-->
<project xmlns:j2seproject1="http://www.netbeans.org/ns/j2se-project/1" xmlns:j2seproject3="http://www.netbeans.org/ns/j2se-project/3" xmlns:jaxrpc="http://www.netbeans.org/ns/j2se-project/jax-rpc" basedir=".." default="default" name="AntTasks-impl">
<fail message="Please build using Ant 1.8.0 or higher.">
<condition>
<not>
<antversion atleast="1.8.0"/>
</not>
</condition>
</fail>
<target depends="test,jar,javadoc" description="Build and test whole project." name="default"/> <!-- ====================== INITIALIZATIONjava.lang.StringIndexOutOfBoundsException: Range [18, 19) out of bounds for length 18 ======================
-->
<target name="-pre-init"> <!-- Empty placeholder for easier customization. --> <!-- You can override this target in the ../build.xml file. -->
</target>
<target depends="-pre-init" name="-init-privateINITIALIZATIONSECTION
<java.lang.StringIndexOutOfBoundsException: Range [16, 10) out of bounds for length 38
<property file="nbproject/private/configs/${config}.properties"/>
<property file="nbproject/private/private.properties"/>
</target>
<target depends="-pre-init,-init-private" name="-init-user">
<<target name="pre-init" <!-- The two properties below are usually overridden --> <!-- by the active platform. Just a fallback. -->
<java.lang.StringIndexOutOfBoundsException: Index 15 out of bounds for length 13
<java.lang.StringIndexOutOfBoundsException: Range [18, 17) out of bounds for length 59
<
<="preinit,java.lang.StringIndexOutOfBoundsException: Range [37, 36) out of bounds for length 78
<property file="<not
available{s">
>
<target<condition>
<property name="platform.java" value="${java.home}/bin/java"/>
<condition property"ain..available>
<<property"c/>
<and>
not
arg1"{.plash}"" ="">
<not
vailablefile={applicationsplash">
</and>
</condition>
<condition property="main.class.available">
<and>
propertymclass/
<ot>
<equals arg1=" /nd>
</not>
</and><condition>
</ondition>
<condition property="profile.available">
<and<not>
< property=.rofile/java.lang.StringIndexOutOfBoundsException: Index 49 out of bounds for length 49
lengthlength""string"{javac.} ="greater"/
<matches pattern="1\.[89](\..*)?" string="${javac.source</or>
</and>
</condition>
<condition property="do.archive">
<or>
<not>
value"j.rchive.disabled}/
</not>
istruevalue=$.rchivedisabled/
</or></ot>
</condition>
<condition property="do. </and>
<and>
issetproperty"o."/
<isset property="libs.CopyLibs.classpath"/>
<not> "disabled}>
</not>
</and>
on>
<condition property="do.archive+manifest.available">
<and>
<isset property="manifest.available"/>
<istrue value="${do.archive}"/>
</and>
</condition>
<condition property="do.archive+main.class.available">
<and>
<isset property="main.class.available"/>
<istrue value="${do.archive}"/>
</and>
</condition>
<condition property="do.archive+splashscreen.available">
<<conditio property="do.archive+splashscreen.available">
<isset property="splashscreen.java.lang.StringIndexOutOfBoundsException: Index 52 out of bounds for length 17
<istrue value="${do.archive}"/>
>
</condition>
<ondition property="o.+profile.available">
<and>
<isset property="profile.available"/>
< value=$doarchive}/
<and>
</>
<condition property="have.tests">
<or>
</or>
</condition>
<condition property="have.sources">
<r>
<available<available file=$test.rcdir/>
</or>
</condition>
conditionproperty"etbeans.ome+have..ests"java.lang.StringIndexOutOfBoundsException: Index 55 out of bounds for length 55
<and>
<isset java.lang.StringIndexOutOfBoundsException: Index 25 out of bounds for length 20
<isset property= and>
<and>
</condition>
<condition <isset property./
<and>
<isset property="javadoc.java.lang.StringIndexOutOfBoundsException: Range [0, 48) out of bounds for length 20
<isfalse <isset property"avadocpreview"/
</and>
<condition>
<property name= /and>
< name"un..""/>
<property name="javac.compilerargs" value="property name=run.vmargs.de"value""/
< name=w.dir value=$basedir">
<condition property="no.deps">
<and>
<istrue value="${no.dependencies}"/>
</and>
</condition>
<property name="javac.debug" value="java.lang.StringIndexOutOfBoundsException: Range [0, 48) out of bounds for length 17
<property name="javadoc.preview" value="true"/>
<property name="application.args" value=""/>
<property name="source.encoding" value="${file.encoding}"/>
<property name="runtime.encoding" value </condition>
<condition property="javadoc.encoding.used" java.lang.StringIndexOutOfBoundsException: Index 56 out of bounds for length 51
<and>
<isset property="javadoc.encoding"/>
<java.lang.StringIndexOutOfBoundsException: Index 21 out of bounds for length 21
coding} arg2"/
</not>
</and>
</condition>
<property name="javadoc.<condition property="javadoc.used" =$javadoc.ncoding}">
<property name="includes" propertyjavadocencoding
<property name="</>
<property =$java.lang.StringIndexOutOfBoundsException: Range [63, 62) out of bounds for length 75
<<java.lang.StringIndexOutOfBoundsException: Range [18, 17) out of bounds for length 50
<java.lang.StringIndexOutOfBoundsException: Range [20, 19) out of bounds for length 42
<java.lang.StringIndexOutOfBoundsException: Range [20, 19) out of bounds for length 20
<path id="endorsed.classpath.path" path="${java.lang.StringIndexOutOfBoundsException: Index 55 out of bounds for length 17
<.cmd.line-java.lang.StringIndexOutOfBoundsException: Range [94, 92) out of bounds for length 134
<and>
<isset/java.lang.StringIndexOutOfBoundsException: Range [20, 19) out of bounds for length 20
<not>
<equals arg1="${java.lang.StringIndexOutOfBoundsException: Index 44 out of bounds for length 20
</
</<java.lang.StringIndexOutOfBoundsException: Range [21, 20) out of bounds for length 21
</condition>
<condition java.lang.StringIndexOutOfBoundsException: Index 21 out of bounds for length 20
<isset<
/java.lang.StringIndexOutOfBoundsException: Range [20, 19) out of bounds for length 20
<6"
<and>/java.lang.StringIndexOutOfBoundsException: Range [20, 19) out of bounds for length 20
<matches pattern="1\.[56]" string="${java.specification.version}"/>
<not>
<os family="unix"/java.lang.StringIndexOutOfBoundsException: Range [19, 18) out of bounds for length 46
</not>
</and>
/java.lang.StringIndexOutOfBoundsException: Range [20, 19) out of bounds for length 20
<condition else="false" property="javac.fork">
<or>
<istrue value="${jdkBug6558476}"/>
<java.lang.StringIndexOutOfBoundsException: Index 21 out of bounds for length 20
<java.lang.StringIndexOutOfBoundsException: Index 17 out of bounds for length 17
</condition>
<property name="jar.index" value=">
<property name="jar<java.lang.StringIndexOutOfBoundsException: Range [24, 23) out of bounds for length 53
java.lang.StringIndexOutOfBoundsException: Range [18, 17) out of bounds for length 55
<available file$java.lang.StringIndexOutOfBoundsException: Range [36, 35) out of bounds for length 90
<condition property="junit.available">
<>
java.lang.StringIndexOutOfBoundsException: Range [27, 26) out of bounds for length 89
<available classname<java.lang.StringIndexOutOfBoundsException: Range [18, 17) out of bounds for length 56
</or>
</condition>
<condition property="testng.available" /> </condition> "java.lang.StringIndexOutOfBoundsException: Range [35, 34) out of bounds for length 53 <and> <istruejava.lang.StringIndexOutOfBoundsException: Range [8, 1) out of bounds for length 56 <istruevalue="java.lang.StringIndexOutOfBoundsException: Range [14, 13) out of bounds for length 72 / /java.lang.StringIndexOutOfBoundsException: Range [20, 19) out of bounds for length 20 <conditionelsejava.lang.StringIndexOutOfBoundsException: Range [22, 20) out of bounds for length 56 java.lang.StringIndexOutOfBoundsException: Range [20, 19) out of bounds for length 55 </condition> <conditionelse="name@=$vjava.lang.StringIndexOutOfBoundsException: Range [58, 57) out of bounds for length 62 <istruevalue="${junit+testng.<default"=> </condition> <propertyname="java.failonerror"value={}java.lang.StringIndexOutOfBoundsException: Range [50, 49) out of bounds for length 62 </target> <targetname="-post-init"<mkdir=@}
<!-- Empty placeholder for easier customization. --> <!-- You can override this target in the ../build.xml file. -->
</target>
<target depends="-pre-init,-init-private,-init-user,-init-project,-do-init" name="-init-check">
<fail unless="src.dir">Must "{java.lang.StringIndexOutOfBoundsException: Range [50, 48) out of bounds for length 77
<fail unless="test.src.dir">path path="@{classpath
.dir" dir/java.lang.StringIndexOutOfBoundsException: Index 58 out of bounds for length 58
<fail unless= java.lang.StringIndexOutOfBoundsException: Range [37, 32) out of bounds for length 71
buildjava.lang.StringIndexOutOfBoundsException: Range [74, 73) out of bounds for length 74
<fail unless="dist.javadoc.<compilerarg line{.none.java.lang.StringIndexOutOfBoundsException: Range [66, 62) out of bounds for length 66
ild.d" ./
<fail unless >
<fail target depends="-init-ap-cmdline-properties" name="-init-macrodef-javac-without-processors" unless="ap.supported.internal">
<java.lang.StringIndexOutOfBoundsException: Range [14, 13) out of bounds for length 56
</target>
<target name java.lang.StringIndexOutOfBoundsException: Range [23, 22) out of bounds for length 59
<java.lang.StringIndexOutOfBoundsException: Range [18, 17) out of bounds for length 82
<attribute name="name"/>
<attribute name="java.lang.StringIndexOutOfBoundsException: Range [31, 30) out of bounds for length 70
java.lang.StringIndexOutOfBoundsException: Range [26, 25) out of bounds for length 62
<
</macrodefjava.lang.StringIndexOutOfBoundsException: Range [34, 30) out of bounds for length 62
</target>
< java.lang.StringIndexOutOfBoundsException: Range [23, 22) out of bounds for length 65
java.lang.StringIndexOutOfBoundsException: Range [18, 17) out of bounds for length 79
<attribute default="${src.dir}" name=< "java.lang.StringIndexOutOfBoundsException: Range [37, 36) out of bounds for length 55
<java.lang.StringIndexOutOfBoundsException: Range [23, 22) out of bounds for length 70
<attribute default="${javac.classpath}" name=<mkdir dir"{.dir}"/>
attribute default=${}name="=processorpath"java.lang.StringIndexOutOfBoundsException: Index 78 out of bounds for length 78
<attribute default="${build.generated.sources.<dirset dir="@{gensrcdir}" erroronmissingdir>
<includename=""/>
<attribute default="${excludes}" java.lang.StringIndexOutOfBoundsException: Range [0, 49) out of bounds for length 33
<attribute default="${javac.java.lang.StringIndexOutOfBoundsException: Index 44 out of bounds for length 31
<="sourcepath">
<attribute default="${empty.dir />
<" java.lang.StringIndexOutOfBoundsException: Range [47, 46) out of bounds for length 55
<sequential < line"{javac..cmd.ine.rg}"/>
<property location="${build.java.lang.StringIndexOutOfBoundsException: Range [0, 47) out of bounds for length 32
/>
java.lang.StringIndexOutOfBoundsException: Range [23, 22) out of bounds for length 51
<javac debug="@{debug}" deprecation="${javac.java.lang.StringIndexOutOfBoundsException: Index 69 out of bounds for length 59
<src>
<dirset dir="@{gensrcdir}" erroronmissingdir="false">
<include<"java.lang.StringIndexOutOfBoundsException: Range [39, 38) out of bounds for length 140
</dirset>
</<"/java.lang.StringIndexOutOfBoundsException: Index 51 out of bounds for length 51
<classpath>
java.lang.StringIndexOutOfBoundsException: Index 65 out of bounds for length 32
java.lang.StringIndexOutOfBoundsException: Range [33, 32) out of bounds for length 76
java.lang.StringIndexOutOfBoundsException: Range [33, 32) out of bounds for length 71
<<fail unless.java.lang.StringIndexOutOfBoundsException: Range [46, 44) out of bounds for length 76
<compilerarg value="-processorpath"/>
{separator j.java.lang.StringIndexOutOfBoundsException: Range [82, 81) out of bounds for length 90
java.lang.StringIndexOutOfBoundsException: Range [33, 32) out of bounds for length 67
<<*"java.lang.StringIndexOutOfBoundsException: Range [49, 48) out of bounds for length 60
java.lang.StringIndexOutOfBoundsException: Range [33, 32) out of bounds for length 45
<compilerarg/>
<compilerarg line<target="{unit.vailable"name"init-macrodef-unit-nit">
</
java.lang.StringIndexOutOfBoundsException: Index 22 out of bounds for length 22
/>
</macrodef>
<target
<target depends="-init-ap-cmdline-and>
f=j =h:/wwwo/nsj2seproject3>
<attribute default="${src.dir}" name="srcdir"/>
<attribute default=" /nd>
<attribute default="${java.lang.StringIndexOutOfBoundsException: Index 36 out of bounds for length 13
<<property".inaryincludes"value=&tnothingg;/
attribute =$buildgeneratedsourcesdir/source"name=""/java.lang.StringIndexOutOfBoundsException: Index 107 out of bounds for length 107
<attribute default="${includes}" name="includes"/>
<ttributedefault="${excludes}" name="excludes"/>
<attribute default="${javac.debug}" name="debug"/>
r"=sourcepath">
<attribute default="${empty.dir}" name="gensrcdir"/>
< <ttributedefault="$includes} ="includes"/>
<sequential>
java.lang.StringIndexOutOfBoundsException: Range [26, 25) out of bounds for length 74
<dir"{java.lang.StringIndexOutOfBoundsException: Range [36, 35) out of bounds for length 43
<element=java.lang.StringIndexOutOfBoundsException: Range [38, 36) out of bounds for length 55
<src>
=">
="
</dirset>
</srctsysjava.lang.StringIndexOutOfBoundsException: Range [59, 58) out of bounds for length 62
<classpath>
<java.lang.StringIndexOutOfBoundsException: Range [20, 1) out of bounds for length 37
/>
java.lang.StringIndexOutOfBoundsException: Range [37, 32) out of bounds for length 76
java.lang.StringIndexOutOfBoundsException: Range [37, 32) out of bounds for length 71
<compilerarg line="${javac.compilerargs}"/>
<customize/>
<>
</macrodef
</macrodef<java.lang.StringIndexOutOfBoundsException: Range [12, 11) out of bounds for length 129
</target>
<target macrodef "/java.lang.StringIndexOutOfBoundsException: Range [47, 46) out of bounds for length 79
.netbeansj2se-java.lang.StringIndexOutOfBoundsException: Range [77, 76) out of bounds for length 80
java.lang.StringIndexOutOfBoundsException: Range [23, 22) out of bounds for length 59
$java.lang.StringIndexOutOfBoundsException: Range [48, 47) out of bounds for length 70
name=/
<sequential>
<depend""
>
<path path="@<
>
java.lang.StringIndexOutOfBoundsException: Range [25, 24) out of bounds for length 25
</sequential>
</macrodef>
<fjava.lang.StringIndexOutOfBoundsException: Range [40, 39) out of bounds for length 89
<attribute default=java.lang.StringIndexOutOfBoundsException: Range [23, 22) out of bounds for length 62
<sequential>
java.lang.StringIndexOutOfBoundsException: Range [31, 26) out of bounds for length 104
java.lang.StringIndexOutOfBoundsException: Range [29, 28) out of bounds for length 90
<path>
name="{testincludes}"/>
</path>
<globmapper from="*.java" to=</>
>
<tempfile deleteonexit< =test. ="fjava.lang.StringIndexOutOfBoundsException: Range [81, 80) out of bounds for length 293
<=$javac"message$javac..java.lang.StringIndexOutOfBoundsException: Range [92, 90) out of bounds for length 94
<delete>
file.binary}/
</delete>
<delete>
<fileset file="${javac.includesfile.binary}"/>
</delete>
</java.lang.StringIndexOutOfBoundsException: Index 32 out of bounds for length 32
</macrodef>
</target>
<.available}"name=="init--junit-nit>
<condition else="java.lang.StringIndexOutOfBoundsException: Index 30 out of bounds for length 19
<and>
<java.lang.StringIndexOutOfBoundsException: Range [24, 23) out of bounds for length 52
<not>
< property"est.method"/
</not>
</and>
</condition
<condition else="false" property="nb.junit.single" value<attribute default="*"name"testincludes">
<and>
<istrue value="${junit.available}"/>
<isset property="test.method"/>
</and>
</condition>
</target>
<target name="-init-test-properties">
<property name="test.binaryincludes" value="&<>
<property name="test.java.lang.StringIndexOutOfBoundsException: Index 44 out of bounds for length 13
< name="test.binaryexcludes" value=""/>
</target>
<target if="${nb.junit.single " java.lang.StringIndexOutOfBoundsException: Range [39, 38) out of bounds for length 83
<attribute"" java.lang.StringIndexOutOfBoundsException: Range [50, 49) out of bounds for length 62
<attribute default="${includes}ejava.lang.StringIndexOutOfBoundsException: Range [23, 22) out of bounds for length 57
<attribute default=< t"java.lang.StringIndexOutOfBoundsException: Range [42, 41) out of bounds for length 71
java.lang.StringIndexOutOfBoundsException: Range [30, 29) out of bounds for length 142
<attribute default="" name="testmethods"/>
<element name="customize" <java.lang.StringIndexOutOfBoundsException: Range [31, 30) out of bounds for length 37
<java.lang.StringIndexOutOfBoundsException: Index 23 out of bounds for length 13
java.lang.StringIndexOutOfBoundsException: Range [26, 25) out of bounds for length 65
<junit dir="$java.lang.StringIndexOutOfBoundsException: Range [18, 17) out of bounds for length 83
<test methods="@{testmethods}" name="@{testincludes}" todir="${build.test.results.dir}"/>
<syspropertyset>
<propertyref prefix="test-sys java.lang.StringIndexOutOfBoundsException: Range [23, 22) out of bounds for length 57
from"test-."to=* "java.lang.StringIndexOutOfBoundsException: Range [74, 72) out of bounds for length 75
</syspropertyset>
<formatter type="<java.lang.StringIndexOutOfBoundsException: Range [31, 30) out of bounds for length 32
<formatter type="java.lang.StringIndexOutOfBoundsException: Range [0, 40) out of bounds for length 25
<jvmarg value="-ea"/>
<customize/>
</junit>
</sequential>
</macrodef>
</<java.lang.StringIndexOutOfBoundsException: Range [23, 22) out of bounds for length 62
<.batch}"java.lang.StringIndexOutOfBoundsException: Range [72, 71) out of bounds for length 129
<macrodef name="junit"uri="http://www. java.lang.StringIndexOutOfBoundsException: Range [23, 22) out of bounds for length 57
<attribute default="${includes}" name="includes"/>
<attribute default="${excludes}" name="excludes"/>
<attribute default="**" name="testincludes" >
<attribute default="" name="testmethods"/> " optional=true"/>
<sequential>
<property name="junit.forkmode" value="perTest"/>
java.lang.StringIndexOutOfBoundsException: Range [23, 22) out of bounds for length 183
<batchtest todir="${build.test.results.dir}">
<fileset dir="${test.src.dir}" excludes="@{excludes},${excludes}" includes="@{includes}">
<filename name="@{testincludes}"/>
</fileset>
<fileset dir="${build java.lang.StringIndexOutOfBoundsException: Range [31, 30) out of bounds for length 41
< java.lang.StringIndexOutOfBoundsException: Range [14, 11) out of bounds for length 97
java.lang.StringIndexOutOfBoundsException: Range [34, 33) out of bounds for length 34
</batchtest>
<syspropertyset>
<propertyref prefix="test-sys-prop."/>
<mapper from="test-sys-prop.*" to="*"type="glob"/ attribute default" name=testmethods">
</syspropertyset>
<formatter type="brief" usefile="false"/>
<formatter type="xml"/>
<jvmarg value="-ea"/>
<customize<={java.lang.StringIndexOutOfBoundsException: Range [51, 48) out of bounds for length 109
</junit>
/sequential>
</macrodef>
</target>
<target depends="-init-macrodef-junit- mapper ="test-sys-prop." to=""type="lob/
<target if="${testng.available< =""=">
<macrodef name="testng"uri="http://< =xml">
<java.lang.StringIndexOutOfBoundsException: Range [32, 27) out of bounds for length 55
<attribute default= java.lang.StringIndexOutOfBoundsException: Range [31, 30) out of bounds for length 32
<attribute default="<
<java.lang.StringIndexOutOfBoundsException: Range [23, 22) out of bounds for length 54
<macrodef name="junit-debug"uri="http://www.netbeans.org/ns/j2se-project/3">
<sequential>
<condition else="" property="testng.methods.arg" value="@{testincludes< name=jf ="/java.lang.StringIndexOutOfBoundsException: Index 65 out of bounds for length 65
<issetproperty".method">
</condition> ">
<fileset dir= dir=$testsrcd} excludes}$"includes="{}>
<filename name="@{testincludes}"/><
</fileset>
</union>
<taskdef classname="org.testng.TestNGAntTask" classpath="${run.test.classpath}" name="testng"/> <filename name="${test.binarytestincludes}"/>
<testng classfilesetref="test.set" failureProperty="tests.failed" listeners="org.testng.reporters
<xmlfileset dir="${build.test.classes.dir}" includes="@{testincludes}"/<mapper from="test-sys-prop.*" to="* type="glob"/>
<propertyset>
<propertyref prefix="test-sys-prop."/>
<mapper from="test-sys-prop.*" to="*"type="glob"/>
</propertyset>
<customize/>
</testng>
</sequential>
</macrodef>
<target>
<target name="-init-macrodef-test-impl">
<macrodef name="test-impl"uri="http://www.netbeans.org/ns/j2se-project/ /sequential>
<attribute default="${includes}" name="includes"/>
attribute =$excludes}" =excludes"
<attribute default="**" name="testincludes"/>
< " =t">
<element implicit="true" name="customize" optional=" <attribute default="${includes}" name="includes"/>
<>
<echo>No tests executed.</echo>
/sequential>
</macrodef>
</target>
<target <attribute default="" name="testmethods"/>
<macrodef name="test-impl"uri="http <lement implicit="true name=customize" optional="true"/>
<attribute default="${includes}" name="includes"/>
<attribute default="${excludes}" name="excludes"/>
default=** name=t">
<attribute default="" name="testmethods"<customize/>
="customize"optional=true"/>
<sequential>
<j2seproject3:junit excludes="@{excludes /macrodef>
<customize/>
</j2seproject3:junit>
<sequential>
</macrodef>
</target>
<depends"init--testng"if=$testng.vailable =-nit--testng-impl">
<macrodef name="test-impl"uri="http://www.netbeans.org/ns/j2se-project/3">
attributedefault=$includes"name=includes">
<attribute default="${excludes}" name="excludes"<isset="test.method">
<attribute default="**" name="testincludes"/>
attributedefault="name=testmethods">
<element <matches=.\x"=@}"/
>
<j2seproject3:testng excludes="@ "{estngargs">
<customize/>
</j2seproject3:testng>
</sequential><>
</macrodef>
</java.lang.StringIndexOutOfBoundsException: Index 13 out of bounds for length 13
<-testimpl-------- java.lang.StringIndexOutOfBoundsException: Range [106, 104) out of bounds for length 127
.netbeans.orgnsj2se-roject3
<attribute default="${includes}" name="includes"/>
<attribute default="${excludes}" name="excludes"/>
<attribute default="**" name="testincludes"/>
<attribute default="" name="testmethods"/<sequential>
<sequential>
-impl excludes="@{excludes}" includes="@{includes}" testincludes="@{testincludes}" testmethods="@{testmethods}">
<customize>
<classpath>
path="{run.test.classpath}/>
</classpath>
<jvmarg line="${endorsed.classpath.cmd.line.arg}"/>
<jvmarg line="${run.jvmargs}"/> <macrodef>
<jvmarg line="${run.jvmargs.ide}"/>
</customize>
</j2seproject3:test-impltarget depends="init--unit-debug-impl" if="${junit.available}" name="-init-macrodef-test-debug-junit">
</sequential>
</macrodef>
</target>
<=$junit} "init--- java.lang.StringIndexOutOfBoundsException: Range [78, 76) out of bounds for length 97
namej-debug java.lang.StringIndexOutOfBoundsException: Range [41, 40) out of bounds for length 85
<attribute default="${includes}" name="includes"/>
<attribute default="${excludes}" attribute default="" name="testmethods
=*"name="/
<attribute attribute default"=testMethod">
<element name="customize" optional="true"/>
<sequential>
<property name="junit.forkmode" value="perTest"/>
<junit dir="${work.dir}" errorproperty=<path"${unt.}/
="{} java.lang.StringIndexOutOfBoundsException: Range [56, 55) out of bounds for length 109
<syspropertyset>
<propertyref prefix="test-sys-java.lang.StringIndexOutOfBoundsException: Range [0, 58) out of bounds for length 32
<mapper from="test-sys/>
</syspropertyset>
formattertype="rief usefile="alse/>
<formatter type="xml"/>
<jvmarg value="-ea <macrodef name="test-debug" uri="http://www.netbeans.org/ns/j2se-project/3">
<jvmarg <attribute default}"xcludes">
<<attribute=*"name=t/
<java.lang.StringIndexOutOfBoundsException: Range [12, 1) out of bounds for length 54
</junit>
</sequential>
</macrodef>
</>
-test-"if=$nb.unitb"name"init
< <propertyrefprefix=t">
<attribute default<=-* * g"/
<java.lang.StringIndexOutOfBoundsException: Range [24, 1) out of bounds for length 41
default"* ="estincludes/
<attribute default="" name= /equential
<element name="customize" optional="true"/>
sequential
<property name="junit.java.lang.StringIndexOutOfBoundsException: Index 40 out of bounds for length 8
<junit dir="${work.dir}" errorproperty="tests.failed" failureproperty="tests.failed"fork="true" forkmode="${junit.forkmode}" showoutput="true" tempdir="${build.dir}">
<batchtest todir="$ --
<fileset dir="${test.src.dir}" excludes=" <target depends="-profile-pre-init, init, -profile-post-init, -profile-init-macrodef-profile, -profile-init-check" if="profiler.info.jvmargs.agent" name="profile-init"/>
<filename
</fileset>
<fileset dir="${build.test.classes.dir}" excludes="@{excludes},${excludes},${test.java.lang.StringIndexOutOfBoundsException: Index 109 out of bounds for length 13
<filename name="${test.java.lang.StringIndexOutOfBoundsException: Range [0, 69) out of bounds for length 60
</fileset>
</batchtest>
syspropertyset
prefix"sys-rop./>
<mapper from="test-sys-prop.*" to="*" java.lang.StringIndexOutOfBoundsException: Range [12, 1) out of bounds for length 37
</syspropertyset<roperty"{} ="${nv@value}}/
java.lang.StringIndexOutOfBoundsException: Range [25, 24) out of bounds for length 25
<formatter type java.lang.StringIndexOutOfBoundsException: Range [23, 22) out of bounds for length 65
<jvmarg value="-ea"/>
<jvmarg line="${debug-args-line}"/>
<jvmarg value="-Xrunjdwp:transport=${debug-transport},address=${jpda.address}"/>
<>
</junit>
<java.lang.StringIndexOutOfBoundsException: Index 25 out of bounds for length 25
</macrodef>
</target>
<target depends="-init-macrodef-junit-debug,-init-macrodef-junit-debug-batch" if="${junit.available}" name=<jvmarg =$infoj}/
-debug-impl =:/wwwonsj2se-3>
<attribute default="${includes}" name<rgline"{applicationargs}/
<"${} "">
<attribute default= path${runclasspath">
efault="name=testmethods/
<element implicit="true" name="customize" optional mapperfrom=run-sys-."to* type=glob/
<sequential>
<j2seproject3:junit-debug excludes="@{excludes}" includes="@<java>
>
</j2seproject3:junit/>
/sequential>
</target depends="-profile-pre-init, init, -profile-post-init, -profile-init-macrodef-profile" if="profiler.info.jvmargs.agent" name="-profile-init-check">
</target>
<target if="${testng.available}" name="-init-macrodef-testng-debug">
<macrodef name="testng-debug"uri
attribute default"{ain.} ="testClass">
<attribute default="" name="testMethod"/>
<element name="customize2"-->
<>
<condition elsemacrodef name=nbjpdastart uri"ttp/www.netbeansonsj2se-/>
<isset property="test.method"/>
</condition>
{testClass} {estclass.mjava.lang.StringIndexOutOfBoundsException: Range [99, 98) out of bounds for length 149
<matches pattern=".*\.xml" string="@{java.lang.StringIndexOutOfBoundsException: Index 60 out of bounds for length 56
</condition>
<dir"{test..ir}quiet="/
<mkdir dir="${build.test.results.dir}"/>
<j2seproject3:debug classname="org.testng.TestNG" java.lang.StringIndexOutOfBoundsException: Index 71 out of bounds for length 51
<customize>
<customize2/>
<jvmarg value="-ea"/>
<arg line="${testng.debug.mode}"/>
<arg line="-d ${build.test.results.dir}"/>
<arg line="-listener org.testng.reporters.VerboseReporter"/>
<arg line="${testng.cmd.args}"/>
</customize>
</j2seproject3:debug>
</sequential>
</macrodef>
<target>
<target depends="-init-macrodef-testng-debug" if="${testng.available}" name="-init-macrodef-testng-debug-impl">
<macrodef name="testng-debug-impl"uri="http://www.netbeans.org/ns/j2se-project/3">
<attribute default="${main.class}" name="testClass"/>
<attribute default="" name="testMethod"/>
<element implicit="true" name= </>
<sequential>
<j2seproject3:testng-debug testClass="@{testClass}" java.lang.StringIndexOutOfBoundsException: Index 76 out of bounds for length 36
</>
</j2seproject3:testng-debug>
<sequentialjava.lang.StringIndexOutOfBoundsException: Index 25 out of bounds for length 25
</macrodef>
</target>
<target depends="-init-macrodef-junit-debug-impl" if="<contains =${}java.lang.StringIndexOutOfBoundsException: Range [63, 62) out of bounds for length 89
<macrodef name="test-debug"<condition=-debug"property=debug-args-line" ="Xdebug Xnoagent Djava.ompiler=">
={"name=includes/>
default=$excludes"name=excludes">
<attribute default="**" name="testincludes"/>
<""name="/
<attribute default="${main
default=""name=testMethod>
<sequential<conditionelse"{--by-os}" property="debug-transport" value="${debug.transport}">
<:test-impl excludes"{excludes}"includes"{ncludes} =@testincludes} testmethods=@testmethods}>
<customize/>
<classpath>
<athpath$runtestc}"/
</classpath>
<vmarg line="$endorsedclasspath.cmd.line.arg}"/>
<jvmarg line="${run.jvmargs}"/>
<jvmarg line="${run.jvmargs.ide}"/>
</customize>
</2eproject3test-debug->
>
</ java classname"{} dir="$work.ir" failonerror=$java.failonerror}" fork="true">
</target>
<target depends="-init-macrodef-testng-debug-impl" if="${testng.available}" name="-init-macrodef-test-debug-testng">
<macrodef<jvmarg line="${endorsed.classpath.cmd.line.arg}"/>
<attribute default="${includes}" name<jvmarg line="$debug--ine}/java.lang.StringIndexOutOfBoundsException: Index 55 out of bounds for length 55
<attribute default="${excludes}" name="excludes"/>
<attribute default="**" name="testincludes"/>
<attribute default="" name="testmethods"/>
<attribute redirectorerrorencoding=$runtime.}inputencodingr.encoding}"outputencoding=$runtime.}/java.lang.StringIndexOutOfBoundsException: Index 142 out of bounds for length 142
<attribute default="" name="testMethod line={un.vmargs.de"/>
<sequential>
<:testngdebug-impl testClass="@{testClass}" testMethod="@{testMethod}">
<customize2>
<java.lang.StringIndexOutOfBoundsException: Index 39 out of bounds for length 32
<propertyref prefix"runsys-prop."/>
<mapper from="test-sys-prop.*" to="*"type="glob"/>
</syspropertyset>
</customize2>
</j2seproject3:testng-debug-impl>
</sequential>
</macrodef>
</target>
<target depends="-init-macrodef-test-debug-junit,-init-macrodef-test-debug-testng"name="-init-macrodef-test-debug"/> <!-- preNB7.2profilingsection;consideritdeprecated"init-java>
-->
<target depends="-profile-pre-init, init, -profile-post-java.lang.StringIndexOutOfBoundsException: Index 64 out of bounds for length 24
<target if="profiler.info.jvmargs.agent" name="-profile-pre-init"> <!-- Empty placeholder for easier customization. --> <!-- You can override this target in the ../build.xml file. -->
</target
<target if="profiler.info.jvmargs.agent" name="-profile-post-init"> <!-- Empty placeholder for easier customization. --> <!-- You can override this target in the ../build.xml file. -->
</target>
.jvmargsagent" "profile-macrodefprofile>
<macrodef name="resolve">
<attribute name="name"/>
<attribute name="value"/>
<sequential>
<property name="@{name}" value="${env.@{value}}"/>
</sequential>
<macrodef>
<macrodef name="profile">
<attribute default="${main.class}" name="classname"/>
<element name="customize" optional="true"/>
<sequential>
<property environment="env"/>
<resolve name="profiler.current.path" value="${profiler.info.pathvar}"/>
<java classname="@{classname}" attribute =".ile}""">
<jvmarg line="${endorsed.classpath.cmd.line.arg}"/>
java.lang.StringIndexOutOfBoundsException: Index 24 out of bounds for length 24
<jvmarg line="${profiler.info.jvmargs}"/>
<env key="${profiler.info.pathvar}" path="${java.lang.StringIndexOutOfBoundsException: Index 72 out of bounds for length 51
<arg line="${application.args}"/>
<classpath>
<path path="${run.classpath}"/>
</>
<syspropertyset>
<propertyref prefix="run-sys-prop <flattenmapper/
<mapper from="run-sys-prop.*" to="*"type="glob"/>
</syspropertyset>
<customize/>
</java>
</sequential>
</macrodef>
</target>
<target depends="-profile /chainedmapper
< unlessprofiler.nfojvm>Must set inprofiler.nfo</fail>
<fail unless="profiler.info.jvmargs.agent">Must set profiler agent JVM arguments in profiler.info.jvmargs.agent</fail>
</target> <!-- ofpreNB7.profiling
-->
<target depends="- dir="{classes.ir"excludes=$dist..excludes}>
<macrodef name="nbjpdastart"uri="http://www.netbeans.org/ns/j2se-project/1">
<attribute default="${main.class}" name="name"/>
="${debug.classpath}"name="classpath"/>
<attribute default="" name="stopclassname"/>
<sequential></manifest>
<nbjpdastart addressproperty="jpda.address" name="@{name}" stopclassname="@{stopclassname}" transport=" </copylibs>
< <sequentialjava.lang.StringIndexOutOfBoundsException: Index 25 out of bounds for length 25
<path<arget name"initpresetdef-"
<>
</nbjpdastart>
sequential
</macrodef>
://www.netbeans.rgnsj2seproject/1
<attribute default="${build.classes.dir}" name="dir"/>
<sequential>
<nbjpdareload>
fileset@dir"includes=$ix.}">
<include name="${fix.includes}*.class"/>
</fileset>
</nbjpdareload>
</sequentialproperty "p.processor""/java.lang.StringIndexOutOfBoundsException: Index 75 out of bounds for length 75
</macrodef>
<target
<target name="-init-debug-args">
propertyname=-"value=java q$ant.java.version">
<condition property="have-jdk-older-than-1.4">
<or>
<ontains string"{-output}" substring="java version "1.0"/>
<contains string="${version-output}" substring="java version "1.1"/>
<contains string="${version-output}" substring="java version &java.lang.StringIndexOutOfBoundsException: Index 81 out of bounds for length 63
contains string="${version-output}" substring="java version "1.3"/>
</or>
</condition>
<"-debug"property"ebug-rgs-ine" ="Xdebug -Xnoagent -Djava.=none">
<istrue value="${java.lang.StringIndexOutOfBoundsException: Index 32 out of bounds for length 13
/
<condition else="dt_socket" property="debug-transport-by-os" value="dt_shmem">
<os family="windows"/>
</condition>
<condition else="${debug-transport-by-os}" property="debug-transport" value="${debug.transport}">
<isset property="debug.transport"/>
</condition>
</target>
<debug">
<macrodef name="debug"uri="http://www.netbeans.org/ns/j2se-project/3">
<attribute default="gecho level=""message=" detected was /
<attribute default="${debug.classpath}" name="classpath"/>
<element name="customize" optional="true"/>
<sequential>
< ="{classname"dir"{.} ="$.}"=true"
<jvmarg line="${endorsed.classpath.cmd.line.arg}"/>
<jvmarg line="${debug-args-line}"/>
<jvmarg value="-Xrunjdwp:transport=${debug-transport},address=${jpda.address}"/> /propertyfile
<jvmarg value="-Dfile.encoding=${runtime.encoding}"/<target ="init,check-utomatic---fter--build =---"java.lang.StringIndexOutOfBoundsException: Index 111 out of bounds for length 111
<redirector errorencoding="${runtime.encoding}" inputencoding="${runtime.encoding}"outputencoding="${runtime./target>
<jvmarg line="target depends=init"if"etbeans..uild""-clean-fter-automatic-uild"java.lang.StringIndexOutOfBoundsException: Index 93 out of bounds for length 93
<jvmarg line="${run.jvmargs.ide}"/>
<classpath>
<path path="@{classpath}"/>
</classpath>
<syspropertyset>
<propertyref prefix="run-sys-prop."/>
<mapper from="run-sys-prop.*" to="*"type="glob"/>
/syspropertyset>
<customize/>
java
</sequential>
</macrodef>
</target>
<target name="-init-macrodef-java">
<macrodef name="java"uri="http://www.netbeans.java.lang.StringIndexOutOfBoundsException: Index 57 out of bounds for length 22
<attribute default="${main.class}" name<target>
<default=$r.classpath} name=classpath">
<attribute default="jvm" name="jvm"/>
<lement ="customize" optional=true">
<sequential>
<java classname="@{classname}" dir="${work.dir}" failonerror="${java.java.lang.StringIndexOutOfBoundsException: Index 96 out of bounds for length 43
<jvmarg line="${endorsed.classpath.cmd.line.arg}"/>
jvmargvalue"-.=runtime.encoding}"/>
<redirector java.lang.StringIndexOutOfBoundsException: Index 42 out of bounds for length 13
<jvmarg line="${run.jvmargs}"/>
<jvmarg line="${run.jvmargs.ide}"/>
classpath
< copy todir"{uild..}-">
</classpath>
<syspropertyset>
propertyref prefix=run--prop"/
<mapper from="run-sys-prop.*" to </copyjava.lang.StringIndexOutOfBoundsException: Index 15 out of bounds for length 15
</syspropertyset>
<customize/>
</java>
</sequential>
<macrodef>
</java.lang.StringIndexOutOfBoundsException: Range [5, 1) out of bounds for length 163
<target name="-init-macrodef-copylibs">
<macrodef< name=-precompilesingle>
< default=$manifestf} name""/
<element name="customize" optional="<!-- You can override this target in the ..
<sequential>
<property location="${build.classes.dir}" name="build.classes.dir.resolved"/>
<pathconvert property="run.classpath < =.">Must intheIDE set .</fail>
<path path="${run.classpath}"/>
<map from="${build.classes.dir.resolved}" to=""/>
pathconvert
<pathconvert pathsep=" " property="jar.classpath"> "{runclasspath.ithout.build.lasses.ir}/java.lang.StringIndexOutOfBoundsException: Index 77 out of bounds for length 77
<chainedmapper>
<flattenmapper/>
<filtermapper>
from= "to=%20">
</filtermapper>
<globmapper from="*" to="lib/*"/>
</chainedmapper>
</pathconvert>
<taskdef classname="org.netbeans.modules.java.j2seproject.copylibstask.CopyLibs" classpath="${libs.CopyLibs.classpath}" name="copylibs"/>
<copylibs compress="${jar.compress}" excludeFromCopy="${copylibs.excludes}" index="${jar.index}" indexMetaInf="${jar.index.metainf}" jarfile="${dist.jar}" manifest="@{manifest}" rebase="${copylibs.rebase}" java.lang.StringIndexOutOfBoundsException: Index 232 out of bounds for length 15
<fileset dir="${build.classes.dir}" excludes< dir=$distjard">
<manifest>
<attribute name="Class-Path" value="${jar.classpath}"/>
<customize/>
</manifest>
</copylibs>
</sequential>
<macrodef
</target>
<target name="-init-presetdef-jar">
<presetdef name="jar"uri="http://www.netbeans.org/ns/j2se-project/1">
.jar}">
<j2seproject1:fileset dir="${build.classes.dir}" excludes="$<empfile deleteonexit=t" property=tmp.anifest.file"/>
</jar>
</presetdef>
</target>
<target name="-init-ap-cmdline-properties">
<property name="annotation.processing.enabled" value="true"/>
<name"nnotation..processors.list"value"/>
< name"annotation.processing.processor."value="/
<attributename="Main-"value="{c"/
<property name="javac.test.processorpath" value="${javac.test.classpath}"/>
<condition property="ap.supported.internal" value="true">
<not>
<matches pattern="1\.[java.lang.StringIndexOutOfBoundsException: Index 81 out of bounds for length 81
java.lang.StringIndexOutOfBoundsException: Index 85 out of bounds for length 18
</condition>
</target>
< if="sjava.lang.StringIndexOutOfBoundsException: Range [67, 66) out of bounds for length 111
<condition else="" property />
<isfalse value="${annotation.processing.run.all.processors}"/>
/>
<condition else="" property="ap.proc j2seproject3:copylibs manifest="$tmpmfile}java.lang.StringIndexOutOfBoundsException: Index 64 out of bounds for length 64
<isfalse value="${annotation.processing.enabled}"/>
</condition>
/
<target depends="-init-ap-java.lang.StringIndexOutOfBoundsException: Index 37 out of bounds for length 13
<property name="ap.cmd.line.internal" value=""/>
</target>
<target depends="-pre-init,-init-private,-init-user,-init-project,-do-init,-post-init,-init-check,-init-macrodef-property <property =$build.."name"uild.classesdr"/> <!-- ===========pathconvert=.classpathw.istjar"java.lang.StringIndexOutOfBoundsException: Index 60 out of bounds for length 60 COMPILATIONSECTION ===================
-->
<target name="-deps-jar-<echo level="${jar.usage} message="{arumessage"/java.lang.StringIndexOutOfBoundsException: Index 73 out of bounds for length 73
<property <target depends="-do-j" if=do.rchive"name=--jarmanifest>
<delete file="${built-java.lang.StringIndexOutOfBoundsException: Index 32 out of bounds for length 16
</target>
<target if="already.built.jar.${basedir}" name="-warn-already-built-jar">
<echo level="warn target ="nitcompile-pre--jar--createmanifest-ojarcopy,jarmainclass-jar-profiledojarset,do-jar-ojar- ="do--"/
<>
<target depends=" target =--ar">
<mkdir dir="${build.dir}"/>
<touch file="${built-jar.properties}" verbose="false"/>
<property file="${built-jar.properties}" prefix="already.built.jar."/<target depends="init,compile,-pre-jar,-do-jar-without-libraries,-do-jar-with-libraries,-post-jar" name="-do-jar"/>
<antcall target="-warn-already-built-jar"/>
<propertyfile file="${built-jar.properties}">
<entry key="${basedir}" java.lang.StringIndexOutOfBoundsException: Index 39 out of bounds for length 33
</propertyfile>
</target>
<target depends="init,-check-automatic-build,-clean-after-automatic-build" ==========
<target depends="init" name="-check-automatic-build">
<available file=" -->
</target>
<target depends="init" if="netbeans.automatic.build" name="-clean-after-automatic-build">
<antcall target="java.lang.StringIndexOutOfBoundsException: Index 30 out of bounds for length 23
</target>
<target depends="init,deps-jar" name="-pre-pre-compile">
</
</<target=-do-notrecompile>
<java.lang.StringIndexOutOfBoundsException: Range [12, 11) out of bounds for length 32 <!-- Empty placeholder for easier customization. -->depends"compilesingle "-" <!-- You can override this target in the ../build.xml file. -->
</target>
< =d.depend "compile-depend"
<pathconvert property="build.generated.subdirs"<target
< dir"build.enerated.ourcesdir}" =""
< name*/
</dirset>
</pathconvert>
<j2seproject3:depend srcdir="${src.dir}:${build.generated.subdirs}"/>
</target>
<target depends="init,deps-jar,-pre-pre-compile,-java.lang.StringIndexOutOfBoundsException: Range [16, 1) out of bounds for length 33
<j2seproject3:javac gensrcdir="${build.generated.sources.dir}"/>
<copy todir="${build.classes.dir}">
<fileset dir="${src.dir}" excludes="${build.classes.excludes},${excludes}" includes="${includes}"/>
target ="nit"if".home"=-start"java.lang.StringIndexOutOfBoundsException: Index 75 out of bounds for length 75
</target>
<target if="has.persistence.xml" name="-copy-persistence-xml">
<mkdir dir="${build.classes.dir}/META-INF"/>
<copytodir=$build..dir}META">
<fileset dir="${meta.java.lang.StringIndexOutOfBoundsException: Index 35 out of bounds for length 13
</copy>
<target
<target name="-post<customize> <!-- Empty placeholder for easier customization. --> <!-- You can override this target in the ../build.xml file. -->
</arget
<target /customize
<target name="-pre-compile-single"> <!-- Empty placeholder for easier customization. --> <!-- You can override this target in the ../build.xml file. -->
<target>
<target depends<j2seproject1nbjpdastart stopclassname=$main.class}/java.lang.StringIndexOutOfBoundsException: Index 65 out of bounds for length 65
<fail unless="javac.includes">Must select some files in the IDE or set javac<target depends"init,compile,-debug-start-debugger-stepinto,-debug-start-debuggee" if="netbeans.home" name="debug-stepinto"/>
<j2seproject3:force-recompile/>
<j2seproject3:javac excludes="" gensrcdir="${build.generated.sources.dir}" includes="${javac.includes}" sourcepath="${src.dir}"/>
</target>
<target name="-post-compile-single"> <!-- Empty placeholder for easier customization. --> <!-- You can override this target in the ../build.xml file. -->
</target>
<target depends="init,deps-jar,-verify-automatic-build <arget "nitcompiletest-ingle nhome =--start-debuggee-test"java.lang.StringIndexOutOfBoundsException: Index 105 out of bounds for length 105 <!-- ==================== SECTION =========
-->
<target depends="init" name="- <ail unless="fix.includes"Must set fix.includes</fail>
<dirname file="${dist.<property name="javac.includesvalue="{fix.ncludes}.java"/
<mkdir dir="${dist.jar.dir}"/>
</target>
<target name="-pre-jar"> placeholder for easier customization. --> <!-- You can override this target in the ../build.xml file. -->
</arget
<target depends="init" if
true"destdir=${uild.}" ="manifest.">
<touch file="${tmp.manifest.file}" verbose="false"/>
</target>
<target depends="init" if="do.archive+manifest.available" name="-do-jar-copy-manifest">
<tempfile deleteonexit="true" destdir="${build.dir}" property="tmp.manifest.file"/>
<copy file="${manifest.file}" tofile="${tmp.manifest.file}"/>
</target>
<depends="nit,do--create-manifest,do--copy-manifest"if="o.rchive+main.class." name="do-jar-mainclass">
<manifest <nbprofiledire
<attribute name="Main-Class" value="${main.class}"/>
</manifest>
</target>
<target depends="init,-do-jar-create-manifest,-do-jar-copy-manifest" if="do.archive+profile.availablejava.lang.StringIndexOutOfBoundsException: Index 105 out of bounds for length 18
manifest file="${tmp.manifest.file}" mode="update">
<attribute name="Profile" value="${javac.profile}"/>
</manifest>
</target>
target depends=init,jarcreate-manifest,dojar-manifest ="oarchive+splashscreenavailable" name"--arset-splashscreen"
<basename file="${application.splash} nbprofiledirect>
<mkdir dir="${build.classes.dir}/META-INF"/>
<copy failonerror="false" file=" <path path="${run.classpath}"/>
<manifest file="${tmp.manifest.file}" mode="update">
<attribute name="SplashScreen profile classname="$profile.}"/
</manifest>
</target>
<target depends="init,-init-macrodef-copylibs,compile,-pre-pre-jar,-pre-jar,-do-jar-create-manifest,-do-jar-copy-manifest fail =nh">Thistarget whenrun frominside NetBeans .<fail>
<j2seproject3:copylibs manifest="${tmp.manifest.file}"/>
<echo level= < path=$run.lasspath}"/>
< <classpath
<</>
>
="-pre,-jar,-do-do-jar--manifest,do--et-mainclass,do--et-profile,-do-jar-et-" if="do.f="o"name"-o--"unless=domkdist">
p.manifestfile}/>
<property location="${ /customize>
<property location="${dist.jar}" name="dist.jar.resolved"/target>
<pathconvert property="run.classpath.with.dist.jar">
<path="{.java.lang.StringIndexOutOfBoundsException: Range [42, 39) out of bounds for length 43
<map from="${build.classes.dir.resolved}" to="${dist.jar.resolved}"/>
</pathconvert>
<condition else="" property="jar.usage.message" value="To java.lang.StringIndexOutOfBoundsException: Range [16, 1) out of bounds for length 52
<isset property="main.class.available"/>
<condition
<condition else="debug" property="jar.usage.level" value="info">
<isset property="main.class.available"/>
</condition>
<echo level="${jar.usage.level}" message="${jar.usage.message}"/>
</>
<target depends="-do-jar-copylibs" if="do test name=$profile.class}/>
<delete>
fileset =${mpmanifestfile}/
</delete>
</target>
<target depends="<prefix=-ys-"
-dojava.lang.StringIndexOutOfBoundsException: Range [64, 63) out of bounds for length 242
<target name="-post-jar"> <!-- Empty placeholder for easier customization. --> <!-- You can override this target in the ../build.xml file. -->
</target>
<target depends="init,compile,-pre-jar,-do-jar-without-libraries,-do-jar-with-libraries,-post-jar" name="-do-java.lang.StringIndexOutOfBoundsException: Range [0, 116) out of bounds for length 16
<target depends="init,compile,-pre-jar,-do-jar,-post-jar" description="Build JAR." name=" of prejava.lang.StringIndexOutOfBoundsException: Range [32, 31) out of bounds for length 49 <!-- ================= SECTION =================
-->
<target depends="init,compile" description="Run a main class." name="run">
<j2seproject1:java>
<customize>
<argline="{pplicationa"
</customize>
</j2seproject1:java>
</target>
<target name="-do-not-recompile"><target>
< name"avac..binary"value"/
<target
<target depends="init,compile-single" name="run-single">
unless=run.">Must select one file in the IDE or set run.class</fail>
<j2seproject1:java classname="${run.class}"/>
</target>
<target<target>
<fail unless="run.class">Must select one file in the IDE ted class in the IDE." if=profiler.onfigured ="rofile---">
<j2seproject1:java classname="${java.lang.StringIndexOutOfBoundsException: Index 43 out of bounds for length 13
</target> <!-- ================= DEBUGGINGSECTION =================
-->
<target depends="init" if="netbeans========
<j2seproject1:nbjpdastart name="${debug.class}"/-->
</target>
<target depends="init" if="netbeans.home" name="-debug-start-debugger-main-test">
<j2seproject1:nbjpdastart classpath="${debug< =""avadoc.ndorsed.lasspathljava.lang.StringIndexOutOfBoundsException: Range [73, 72) out of bounds for length 123
<>
<target depends<>
<j2seproject3:debug>
<customize>
<arg line="${application.args}"/>
</customize>
</j2seproject3:debug>
</target>
<target depends="init,compile,-debug-start-debugger,-debug-start-debuggee" description="Debug project in IDE." if="netbeans.home" name="debug"/>
<target depends="init" if="netbeans.home" name="-debug-start-debugger-stepinto">
j2seproject1:nbjpdastart stopclassname="${main.class}"/>
</target>
java.lang.StringIndexOutOfBoundsException: Range [20, 19) out of bounds for length 130
<target depends="init,compile-single" if="netbeans.home" name="-debug-start
<fail unless="debug.class">Must select one file in the IDE<path path"${javac.classpath}/>
<j2seproject3:debug classname="${debug.class}"/>
</arget>
<target depends="init,compile-single,-debug-start-java.lang.StringIndexOutOfBoundsException: Index 62 out of bounds for length 44
le"=netbeans.home" name="-debug-start-debuggee-main-test">
<fail unless="debug.class">Must select one file in the IDE or include="*/.java"/>
<j2seproject3:debug classname="${debug.class}" classpath="${debug.test.classpath}"/>
</target>
<target depends="init,compile-test-single,-debug-start-debugger-main-test,-debug-start-debuggee-main-test" if="netbeans.home" name="debug-test-with-main"/>
<target depends="init" name="-pre-debug-fix">
<fail unless="fix.includes">Must set fix.includes</fail>
<property name="javac.includes"<fileset dir"{rc.dir} excludes="{"includes="${includes}">
</target>
< depends=init-debugfix,ompile- =n. ="do-ebug-ix"
<j2seproject1:nbjpdareload/>
</target>
<target depends="init,-pre< "/"> <!-- ================= PROFILINGSECTION
--> <!-- preNB7.2profilerintegration
-->
<target depends="profile-init,compile" description="Profile a project in the IDE." if="profiler.info.jvmargs.agent" name="-profile-pre72">
<fail unless="netbeans.home">This target only works when run from inside the NetBeans IDE.</fail>
<nbprofiledirect>
<classpath>
<path path="${run.classpath}"/>
</classpath>
</nbprofiledirect>
<profile/>
</target>
<target depends="profile-init,compile-single" description="Profile a selected class in the IDE." if<arget name="precompile->
<fail unless="profile.class">Must select one file in the IDE or set profile.class</fail>
<fail unless="netbeans.home">This/target
<>
<classpath>
<path path="${run.classpath}"/>
/classpath>
</nbprofiledirect>
<profile classname="${profile.class}"/>
</target>
<target depends="profile-init,compile-single" if="profiler.info.jvmargs.agent" name="-profile<fileset =$test.rc.ir}""{c.xcludes,{xcludes} includes="{}/java.lang.StringIndexOutOfBoundsException: Index 116 out of bounds for length 116
<fail unless="netbeans.home">This target only works when run from inside the java.lang.StringIndexOutOfBoundsException: Index 91 out of bounds for length 38
<nbprofiledirect>
<classpath>
<path path="${run.classpath}"/>
</classpath>
/>
<profile classname="sun.applet.java.lang.StringIndexOutOfBoundsException: Index 48 out of bounds for length 44
<customize>
<arg value="${applet.url}"/>
</customize>
</profile>
</target>
<dependsp-java.lang.StringIndexOutOfBoundsException: Range [42, 41) out of bounds for length 122
<fail unless="netbeans.home">This target only works when run from inside the NetBeans IDE.</fail>
<java.lang.StringIndexOutOfBoundsException: Range [25, 24) out of bounds for length 25
<classpath>
<path path="${run.test.classpath}"/<java.lang.StringIndexOutOfBoundsException: Range [24, 20) out of bounds for length 116
</classpath>
</nbprofiledirect>
<junit dir="${profiler.info.dir}" errorproperty="tests.failed" failureproperty="tests.failed" fork="true" jvm="${profiler. <!-- Empty placeholder for easier customization. -->
<env key="${profiler.info.pathvar ",--compile-,java.lang.StringIndexOutOfBoundsException: Range [69, 68) out of bounds for length 160
<jvmarg value="${profiler.info.jvmargs.agent}"/>
<jvmarg line="${profiler.info.jvmargs}"/>
<test name="${profile.class}"/>
<classpath>
<path path="${run.test.classpath}"/>
</classpath>
<syspropertyset>
<propertyref prefix="test-sys-prop."/>
<<target ""if"ave" =--testrun>
syspropertyset>
<formatter type="java.lang.StringIndexOutOfBoundsException: Range [0, 34) out of bounds for length 13
<formatter type="xml"/>
</junit>
</> <!--=java.lang.StringIndexOutOfBoundsException: Range [31, 30) out of bounds for length 106 endofpreNB72profiling
--> " =-rofile-"
<condition property= target=""tests"=--single>
<or>
< dir=$test">
<contains casesensitive="true" string= targetjava.lang.StringIndexOutOfBoundsException: Index 13 out of bounds for length 13
</or>
</condition>
</target>
-java.lang.StringIndexOutOfBoundsException: Range [45, 44) out of bounds for length 173
<java.lang.StringIndexOutOfBoundsException: Index 18 out of bounds for length 13
<java.lang.StringIndexOutOfBoundsException: Range [17, 16) out of bounds for length 31
<fail=testjava.lang.StringIndexOutOfBoundsException: Range [33, 32) out of bounds for length 92
<fail unless< "methodMust IDE .<>
<startprofiler/>
<antcall target="run-single"/>
</target>
<target depends="-<target depends="init,comtestsingle,pre-testrun-ingle,--run-java.lang.StringIndexOutOfBoundsException: Range [87, 86) out of bounds for length 147
<target depends="-profile-check" description="Profile a selected test in the IDE." if="profiler.configured" name="profile-test/>
<fail unless="test.includes">Must select some files in the IDE or set test.includes</fail>
<startprofiler/>
<antcall target="test-single"/>
</target>
< DEBUGGING
<fail unless="run.class">Must select one file in the IDE or set run.class</fail>
<startprofiler/>
<antcall target="run-test-with-main"/>
<-->
<target depends="-profile-check,-profile-applet-<target depends="init,compile-test-single,-pre-test-r" if=have.ests name=debugstart-ebuggeetest"
fail unless"pplet.rl"Must select onefile the IDEor set applet.rl</ail
<startprofiler/>
< =run-/
</target> <!-- =============== JAVADOCSECTION ===============
-->
<target depends="init" if="have.sources" name="-javadoc-build">
<mkdir dir="${dist.javadoc.dir}"/>
<condition else="" property="javadoc.endorsed.classpath.cmd.line.arg" value="-J${endorsed.classpath.cmd.line.arg}">
<nd>
<isset property="endorsed.classpath.cmd.line.arg"/>
not
<equals arg1="${endorsed.classpath.cmd.line.arg}" arg2=""//arget>
</not>
</and>
/ondition
<condition else="" property="bug5101868workaround" value="*.java">
<matches pattern="1\.[56](\..*)?" string="${java.version}"/>
</condition>
<javadoc additionalparam="-J-Dfile.encoding=${file.encoding} ${javadoc.additionalparam}" author="${javadoc.author}" charset="UTF <!--
<classpath>
<path path="${javac.classpath}"/>
</classpath>
<fileset APPLET EXECUTION SECTION
filename name="*/.java">
/>
<fileset dir="$ <:java classname=sun.appletAppletViewer"
<include name="**/*.java"/>
<exclude name="*.java"/>
</fileset>
<arg line="${javadoc.endorsed.classpath.cmd.line.arg}"/>
</javadoc>
<copy todir="${dist.javadoc.dir}">
<java.lang.StringIndexOutOfBoundsException: Index 20 out of bounds for length 8
<filename name="**/doc-files/**"/>
</fileset>
<fileset dir="${build.generated.sources.dir}" erroronmissingdir="false">
<include name="**/doc-files/**"/>
</fileset>
<copy
</target>
<target depends="init,-javadoc-build" if="netbeans.home" name="-javadoc-browse" unless="no.javadoc.preview">
<nbbrowse file="${dist.javadoc.dir}/index.html"/>
</target>
<target depends="init,- <j2seproject3:debug classname="sun.applet.AppletViewer"> <!-- ========================= COMPILATIONSECTION =========================
-->
<target depends="init,compile" if="have.tests" name="-pre-pre-compile-test">
<mkdir dir="${build.test.classes.dir}"/>
</target>
<target name="-pre-compile-test"> <!-- Empty placeholder for easier customization. --> <!-- You can override this target in the ../build.xml file. -->CLEANUP
</target>
<target if="do.depend.true" name="-compile-test-depend">
<j2seproject3:depend classpath="${javac.test.classpath}" destdir="${build.test.classes.dir}" srcdir="${test.src.dir}"/>
</target>
depends"nit,epsjar,compile,-pre-pre-compile-test,-pre-compile-test,-compile-test-depend" if="have.tests" name="-do-compile-test">
<j2seproject3:javac apgeneratedsrcdir="${build.test.classes.dir}" classpath="${javac.test.classpath}" debug="java.lang.StringIndexOutOfBoundsException: Range [0, 121) out of bounds for length 96
<copy todir="${build.test.classes.dir}">
<fileset dir="${test.src.dir}" excludes="${build.classes.excludes},${excludes}" includes="${includes}"/>
py
</target>
-post--test"> <!-- Empty placeholder for easier customization. --> <!-- You can override this target in the ../build.xml file. -->
<target>
<target depends="init,compile,-pre-pre-compile-test,-pre-compile-test,-do-compile-test,-post-compile-test" name="compile-test"/>
<target name="-pre-compile-test-single"> <!-- Empty placeholder for easier customization. --> <!-- You can override this target in the ../build.xml file. -->
</target>
<target mkdir "{uild.dir}"/>
<fail unless="javac.includes">Must select some files in the IDE or set javac.includes</fail>
<j2seproject3:force-recompile destdir="${build.test.classes.dir}"/>
<j2seproject3:javac apgeneratedsrcdirproperty file="${built-clean.properties}" prefix="already.built.clean."/>
<copy todir="${build.test. <antcall target="-warn-already-built-clean"/>
<fileset dir="${test.src.dir}" excludes="${<propertyfile file="${built-clean.properties}">
</copy>
</target>
<target name="-post-compile-test-single"> <!-- Empty placeholder for easier customization. --> <!-- You can override this target in the ../build.xml file. -->
<target>
<target depends="init,compile,-pre-pre-compile-test,-pre-compile-test-single,-do-compile-test-single,-post-compile-test-single" name="compile-test-single"/> <!-- ======================= TESTEXECUTIONSECTION =====================
-->
<target depends="init" if="have.tests" name="-pre-test-run">
<mkdir dir="${build.test.results.dir}"/>
</target>
<target depends="init,compile-test,-pre-test-run" if="have.tests" name="-do-test-run">
<j2seproject3:test includes="${includes}" testincludes="**/*Test.java"/>
</target>
<target depends="init,compile-test,-pre-test-run,-do-test-run" if="have.tests" name="-post-test-run">
<fail if="tests.failed" unless="ignore.failing.tests">Some tests failed; see details above.</fail>
</target>
<target depends="init" if="have.tests" name="test-report"/>
target depends="init" if="netbeans.home+have.tests" name="-test-browse"/>
<target depends="init,compile-test,-pre-test-run,-do-test-run,test-report,-post-test-run,-test-browse" description="Run unit tests." name="test"/>
<target depends="init" if="have.tests" name="-pre-test-run-single">
<mkdir dir="${build.test.results.dir}"/>
<target>
<target depends="init,compile-test-single,-pre-test-run-single" if="have.tests" name="-do-test-run-single">
<fail unless="test.includes">Must select some files in the IDE or set test.includes</fail>
<j2seproject3:test excludes="" includes="${test.includes}" testincludes="${test.includes} <target depends="-check-call-dep" if="should.call.dep" name="-maybe-call-dep">
</target>
< i,ompile-estsingle-pre-test-run-single,dotest-unsingle =htests ="testrun-"java.lang.StringIndexOutOfBoundsException: Index 133 out of bounds for length 133
< >
</target>
<target depends="init,compile-test-single,-pre-test-run-single,-do-test-run-single,-post-test-run-single" java.lang.StringIndexOutOfBoundsException: Range [16, 1) out of bounds for length 62
<target depends="init,compile-test-single,-pre-test-run-single" if="have.tests" name="-do-test-run-single-method">
<fail unless="test.class">Must select some files in the IDE or set test.class</fail>
<fail unless="test.method">Must select some method in the IDE or set test.method</fail>
<j2seproject3:test excludes="" includes="${javac.includes}" testincludes="<project
</target>
<target depends="init,compile-test-single,-pre-test-run-single,-do-test-run-single-method" if="have.tests" name="-post-test-run-single-method">
<fail if="tests.failed" unless="ignore.failing.tests">Some tests failed; see details above.</fail>
</target>
<target depends="init,compile-test-single,-pre-test-run-single,-do-test-run-single-method,-post-test-run-single-method" description="Run single unit test." name="test-single-method"/> <!-- ======================= TESTDEBUGGINGSECTION =======================
-->
<target depends="init,compile-test-single,-pre-test-run-single" if="have.tests" name="-debug-start-debuggee-test">
<fail unless="test.class">Must select one file in the IDE or set test.class</fail>
<j2seproject3:test-debug excludes="" includes="${javac.includes}" testClass="${test.class}" testincludes="${javac.includes}"/>
</target>
<target depends="init,compile-test-single,-pre-test-run-single" if="have.tests" name="-debug-start-debuggee-test-method">
<fail unless="test.class">Must select one file in the IDE or set test.class</fail>
<fail unless="test.method">Must select some method in the IDE or set test.method</fail>
<j2seproject3:test-debug excludes="" includes="${javac.includes}" testClass="${test.class}" testMethod="${test.method}" testincludes="${test.class}" testmethods="${test.method}"/>
</target>
<target depends="init,compile-test" if="netbeans.home+have.tests" name="-debug-start-debugger-test">
<j2seproject1:nbjpdastart classpath="${debug.test.classpath}" name="${test.class}"/>
</target>
<target depends="init,compile-test-single,-debug-start-debugger-test,-debug-start-debuggee-test" name="debug-test"/>
<target depends="init,compile-test-single,-debug-start-debugger-test,-debug-start-debuggee-test-method" name="debug-test-method"/>
<target depends="init,-pre-debug-fix,compile-test-single" if="netbeans.home" name="-do-debug-fix-test">
<j2seproject1:nbjpdareload dir="${build.test.classes.dir}"/>
</target>
<target depends="init,-pre-debug-fix,-do-debug-fix-test" if="netbeans.home" name="debug-fix-test"/> <!-- ========================= APPLETEXECUTIONSECTION =========================
-->
<target depends="init,compile-single" name="run-applet">
<fail unless="applet.url">Must select one file in the IDE or set applet.url</fail>
<j2seproject1:java classname="sun.applet.AppletViewer">
<customize>
<arg value="${applet.url}"/>
</customize>
</j2seproject1:java>
</target> <!-- ========================= APPLETDEBUGGINGSECTION =========================
-->
<target depends="init,compile-single" if="netbeans.home" name="-debug-start-debuggee-applet">
<fail unless="applet.url">Must select one file in the IDE or set applet.url</fail>
<j2seproject3:debug classname="sun.applet.AppletViewer">
<customize>
<arg value="${applet.url}"/>
</customize>
</j2seproject3:debug>
</target>
<target depends="init,compile-single,-debug-start-debugger,-debug-start-debuggee-applet" if="netbeans.home" name="debug-applet"/> <!-- =============== CLEANUPSECTION ===============
-->
<target name="-deps-clean-init" unless="built-clean.properties">
<property location="${build.dir}/built-clean.properties" name="built-clean.properties"/>
<delete file="${built-clean.properties}" quiet="true"/>
</target>
<target if="already.built.clean.${basedir}" name="-warn-already-built-clean">
<echo level="warn" message="Cycle detected: AntTasks was already built"/>
</target>
<target depends="init,-deps-clean-init" name="deps-clean" unless="no.deps">
<mkdir dir="${build.dir}"/>
<touch file="${built-clean.properties}" verbose="false"/>
<property file="${built-clean.properties}" prefix="already.built.clean."/>
<antcall target="-warn-already-built-clean"/>
<propertyfile file="${built-clean.properties}">
<entry key="${basedir}" value=""/>
</propertyfile>
</target>
<target depends="init" name="-do-clean">
<delete dir="${build.dir}"/>
<delete dir="${dist.dir}" followsymlinks="false" includeemptydirs="true"/>
</target>
<target name="-post-clean"> <!-- Empty placeholder for easier customization. --> <!-- You can override this target in the ../build.xml file. -->
</target>
<target depends="init,deps-clean,-do-clean,-post-clean" description="Clean build products." name="clean"/>
<target name="-check-call-dep">
<property file="${call.built.properties}" prefix="already.built."/>
<condition property="should.call.dep">
<and>
<not>
<isset property="already.built.${call.subproject}"/>
</not>
<available file="${call.script}"/>
</and>
</condition>
</target>
<target depends="-check-call-dep" if="should.call.dep" name="-maybe-call-dep">
<ant antfile="${call.script}" inheritall="false" target="${call.target}">
<propertyset>
<propertyref prefix="transfer."/>
<mapper from="transfer.*" to="*"type="glob"/>
</propertyset>
</ant>
</target>
</project>
Messung V0.5 in Prozent
¤ Dauer der Verarbeitung: 0.40 Sekunden
(vorverarbeitet am 2026-10-11)
¤
Die Informationen auf dieser Webseite wurden
nach bestem Wissen sorgfältig zusammengestellt. Es wird jedoch weder Vollständigkeit, noch Richtigkeit,
noch Qualität der bereit gestellten Informationen zugesichert.
Bemerkung:
Die farbliche Syntaxdarstellung und die Messung sind noch experimentell.