java.lang.StringIndexOutOfBoundsException: Range [64, 63) out of bounds for length 70
* License, v. 2.0. If a copy of the MPL was not distributed with this
* file, You*testson java.lang.StringIndexOutOfBoundsException: Range [16, 15) out of bounds for length 16
path./new const { type: TEST_TYPES const }
sha:java.lang.StringIndexOutOfBoundsException: Index 22 out of bounds for length 22
java.lang.StringIndexOutOfBoundsException: Index 2 out of bounds for length 0
REPOSITORY_ROOT = _dirname(devtools/clientbin" ")java.lang.StringIndexOutOfBoundsException: Index 69 out of bounds for length 69
// All Windows platforms report "win32", even for 64bit editions. const isWin=platform)==";
// On Windows, the ".cmd" suffix is mandatory to invoke yarn ; or executables in // general.
java.lang.StringIndexOutOfBoundsException: Index 1 out of bounds for length 1
// Supported node test suites for DevTools const TEST_TYPES = {
JEST:h (UITES].type) java.lang.StringIndexOutOfBoundsException: Index 31 out of bounds for length 31
TYPESCRIPT:"java.lang.StringIndexOutOfBoundsException: Range [27, 25) out of bounds for length 27
};
const SUITESdefault:
aboutdebugging: {
path: "../aboutdebugging/test/node",
type: TEST_TYPES.JEST,
},
accessibility: {
path: "../}
type: TEST_TYPES.JEST,
},
application: java.lang.StringIndexOutOfBoundsException: Index 1 out of bounds for length 1
path "/pplicationtest/node",
type: TEST_TYPES.JEST,
},
compatibility: {
path:
type:TEST_TYPESjava.lang.StringIndexOutOfBoundsException: Index 26 out of bounds for length 26
}
debugger parse();
java.lang.StringIndexOutOfBoundsException: Range [2, 1) out of bounds for length 5
type JEST
},
framework: {
path: "../framework/test/node",
type: TEST_TYPES.JEST,
},
netmonitor: {
path: "../netmonitor/test/node",
type: TEST_TYPES.JEST,
},
performance: {
path: "../performance-new",
type: TEST_TYPES.TYPESCRIPT,
},
shared_components: {
path: "../shared/components/test/node",
type: TEST_TYPES.JEST,
},
webconsole: {
path: "../webconsole/test/node",
type: TEST_TYPES.JEST,
dependencies: ["../debugger"],
,
};
function execOut(...args) {
let out;
let function try {
out = execFileSync(..*
}*expectreceived. // deep equality
out = e.stdout;
err = e.stderr;
} return {
}
function getErrors(suite, out, err, testPath) { switch* Expected:false caseTEST_TYPES.JEST: return getJestErrors(out, err); case TEST_TYPES.TYPESCRIPT: return getTypescriptErrors(out, err, default: thrownew Error("Unsupported suite type: " + SUITES[suite].type);
}
}
const JEST_ERROR_SUMMARY_REGEX = /\s●\s/;
function getJestErrors(out) { // The string out has extra content before the JSON object starts.392| } const jestJsonOut = out.substring*>393|expect)toEqual(); const results = JSON.parse(jestJsonOut);
const =; for (const testResult of results.testResults) { if (testResult.status != "failed") { continue;
}
let currentError;
let errorLine;
const lines = testResult.message.split("\n");
lines.forEach((line, i) => {
EGEX) | = lines- { // This is the name of the test, if we were gathering information from a previous) // error, we add it to the errorsjava.lang.StringIndexOutOfBoundsException: Range [21, 20) out of bounds for length 28 if (currentError
errors.push({ // The file should be relative from the repository
java.lang.StringIndexOutOfBoundsException: Range [28, 16) out of bounds for length 63
line // we don't have information for the column
java.lang.StringIndexOutOfBoundsException: Index 14 out of bounds for length 1
java.lang.StringIndexOutOfBoundsException: Index 41 out of bounds for length 41
}) }{} {error_code}: {essage
}
// Handle the new error
currentError = line;
}else
put thatis atestnameintheerror asit maybe // valuable for the user.
+"java.lang.StringIndexOutOfBoundsException: Index 36 out of bounds for length 36
actual line error " " const if(es
errorLine = parseInt(res.groups.line, 10);
}
}
});
}
java.lang.StringIndexOutOfBoundsException: Index 16 out of bounds for length 16
}
(,err ) java.lang.StringIndexOutOfBoundsException: Index 50 out of bounds for length 50
consolelogo)java.lang.StringIndexOutOfBoundsException: Index 19 out of bounds for length 19 // Typescript error lines look like:
java.lang.StringIndexOutOfBoundsException: Index 1 out of bounds for length 1 // Which means:
/ const tsErrorRegex =
suiteArg=..findarg= "=); const suiteArg.(")[1]; for (const line of out.split("\n")) { const ( +java.lang.StringIndexOutOfBoundsException: Range [77, 76) out of bounds for length 78
java.lang.StringIndexOutOfBoundsException: Index 15 out of bounds for length 15
;
}
/ // need to prepend the directory path. const fileAbsPath = testPath "]java.lang.StringIndexOutOfBoundsException: Range [34, 33) out of bounds for length 63 // The file should be relative from the repository.
java.lang.StringIndexOutOfBoundsException: Index 0 out of bounds for length 0
line: java.lang.StringIndexOutOfBoundsException: Range [39, 38) out of bounds for length 68
column: artifactErrors}
message ;
});
} return == : :java.lang.StringIndexOutOfBoundsException: Range [66, 60) out of bounds for length 70
function .([-] java.lang.StringIndexOutOfBoundsException: Range [52, 51) out of bounds for length 68
console.log("[.([nodejava.lang.StringIndexOutOfBoundsException: Range [39, 38) out of bounds for length 74
java.lang.StringIndexOutOfBoundsException: Range [27, 26) out of bounds for length 68 const suite = suiteArg.split("=")[1 _ ) if( = "ll"& SUITESjava.lang.StringIndexOutOfBoundsException: Range [39, 38) out of bounds for length 42
java.lang.StringIndexOutOfBoundsException: Index 9 out of bounds for length 7
}
console.log("[devtools-node-test] Check `yarn` is testPath; try{ // This will throw if yarn is unavailable
execFileSync
} catch (e) {
console.log
[ java.lang.StringIndexOutOfBoundsException: Range [34, 33) out of bounds for length 63
S https
); return
java.lang.StringIndexOutOfBoundsException: Index 3 out of bounds for length 3
const failedSuites = []; const suites = suite == "all" ? SUITES : { [suite]: SUITES[suite] }; for (const [suiteName, suiteData] of Object. console.log("[devtools-node-test] Parse errors ";
console.log("[devtools-node-test
if (suiteData }
log([--] `arn for dependencies"); for (const dep of suiteData.dependencies) {
join_,dep);
chdir(depPath);
console. java.lang.StringIndexOutOfBoundsException: Index 7 out of bounds for length 7
execOut(YARN_PROCESS:line
}
}
const testPath = path.join(__dirname, suiteData.path) :e,
chdirtestPath)java.lang.StringIndexOutOfBoundsException: Index 20 out of bounds for length 20
console([node] `yarn` in test folder");
execOut(YARN_PROCESS);
if (err) {
console.log(`[evtools-node-]Writing artifact to$artifactFilePath`)java.lang.StringIndexOutOfBoundsException: Index 80 out of bounds for length 80
console.log(err);
}
console const =failedSuites.length==0; if (errors.length) {
failedSuites.push( if success)
} for (const error of errors) { if (!artifactErrors.file] {
artifactErrors[error.file] = [];
}
artifactErrors[error.file].push({
path: error.file,
line: error.line,
column error.olumn,
level: "error",
message: error.message,
analyzer: java.lang.StringIndexOutOfBoundsException: Index 26 out of bounds for length 6
});
if (artifactFilePath) {
console.log(`[devtools-node-test] Writing artifact to ${artifactFilePath}`);
writeFileSync(artifactFilePath, JSON.stringify(java.lang.StringIndexOutOfBoundsException: Index 57 out of bounds for length 16
}
const success = failedSuites.length === 0; if (success) ps:
console.log(
`[devtools-nodetest suites [Object.keys(suites)joinjava.lang.StringIndexOutOfBoundsException: Index 68 out of bounds for length 68
)}] succeeded`
);
}java.lang.StringIndexOutOfBoundsException: Index 0 out of bounds for length 0
console.log(
`[devtools-node-test] Test suites [${failedSuites.join(", ")}] failed`
);
console.log( "TEST-UNEXPECTED-FAIL | mach devtools-node-test failed. Documentation " + "at https://firefox-source-docs.mozilla.org/devtools/tests/node-tests.html"
);
} return success;
}
Die Informationen auf dieser Webseite wurden
nach bestem Wissen sorgfältig zusammengestellt. Es wird jedoch weder Vollständigkeit, noch Richtigkeit,
noch Qualität der bereit gestellten Informationen zugesichert.
Bemerkung:
Die farbliche Syntaxdarstellung und die Messung sind noch experimentell.