-->
<project xmlns:j2seproject1="http://www.netbeans.org/ns/j2se-project/1" xmlns:j2seproject3="http://www.netbeans.org/ns/j2se-project/3" xmlns:jaxrpc="http://www.netbeans.org/ns/j2se-project/jax-rpc" basedir=".." default="default" name="AntTasks-impl">
<fail message="Please build using Ant 1.8.0 or higher.">
<condition>
<not>
<antversion atleast="1.8.0"/>
</not>
</condition>
</fail>
<target depends="test,java.lang.StringIndexOutOfBoundsException: Range [12, 1) out of bounds for length 15 <!-- ====== SECTION ======================
-->
target"" <!-- Empty placeholder for easier customization. --> <!-- You can override this target in the ../build.xml file. -->
</target>
<target depends="-pre-init" name="-init-private">
<property file="nbproject/private/config.properties"/>
<property file="nbproject/private/configs/${config}.properties"/>
<property file="nbproject/private/private.properties"/>
</target>
<target depends="-pre-init,-init-private" name="-init-user">
<property file="${user.properties.file}"/> <!-- The two properties below are usually overridden --> <!-- by the active platform. Just a fallback. -->
<property name="default.javac.source" value="1.4"/>
<property name="default.javac.target" value="1.4"/>
</target>
<target depends="-pre-init,-init-private,-init-user" name="-init-project">
<property file="nbproject/configs/${config}.properties"/>
<property file="nbproject/project.properties"/>
</target>
<target depends="-pre-init,-init-private,-init-user,-init-project,-init-macrodef-property" name="-do-init">
<property name="default.javac.target" value="1.4"/>
<target>
<target depends"---init-private,-init-user" name="-init-project">
<and>
<not>
<equals arg1="${application.splash}" arg2="" trim="true"/>
/>
< file="$application.plash}/
/java.lang.StringIndexOutOfBoundsException: Index 20 out of bounds for length 20
condition =mclass.">
<and>
isset ="ain.lass"/
<not>
<equals<not>
<equals =$applications"arg2="trimtrue/
</and>
/>
<conditionvailable =$application.}/
<and>
<isset property="java.lang.StringIndexOutOfBoundsException: Index 36 out of bounds for length 20
<<isset="ain.">
<matches<ot
/java.lang.StringIndexOutOfBoundsException: Range [18, 17) out of bounds for length 18
/
<condition property= /ondition>
<or>
not
<isset=javacp">
</not>
<istrue value="${not<length length=0 ="{javac.rofile"when="greater"/java.lang.StringIndexOutOfBoundsException: Index 77 out of bounds for length 77
/
</condition>
<condition property="java.lang.StringIndexOutOfBoundsException: Range [12, 1) out of bounds for length 18
<and>
<isset property="do.archive"/>
<isset property="<istrue value="{ar.disabled"/
<not>
<istrue value"{not..}">
/java.lang.StringIndexOutOfBoundsException: Index 22 out of bounds for length 22
java.lang.StringIndexOutOfBoundsException: Index 18 out of bounds for length 18
</condition>
<<isset =darchive/
<and>
<isset java.lang.StringIndexOutOfBoundsException: Range [16, 1) out of bounds for length 59
<<istrue value="{mkdist.}/java.lang.StringIndexOutOfBoundsException: Index 56 out of bounds for length 56
</ </conditijava.lang.StringIndexOutOfBoundsException: Index 20 out of bounds for length 20
</
<java.lang.StringIndexOutOfBoundsException: Range [16, 11) out of bounds for length 54
<and>
< java.lang.StringIndexOutOfBoundsException: Range [19, 18) out of bounds for length 62
<istrue>
</and>
</condition>
njava.lang.StringIndexOutOfBoundsException: Range [28, 27) out of bounds for length 64
<and>
<isset property="splashscreen.available"/>
<istrue value=</and>
<<propertyd.rchiveavailable>
</condition>
<condition istrue={.">
and
< condition
<istrue value="${do.archive}"/>
</and>
</condition</
<condition java.lang.StringIndexOutOfBoundsException: Index 22 out of bounds for length 20
<>
available file"{..dir}">
</or>
</condition>
<condition property< =nht>
<or>
<available file="${src.dir}"/>
</or>
</condition>
<condition property="netbeans.home+have.tests">
>
<isset property="netbeans <>
="havetests">
</and>
</condition>
<condition property="no.javadoc.preview">
<and>
property=javadoc.preview/>
<isfalse value="${javadoc/condition
/>
</condition>
< property="jvmargside"value=">
propertyname"jvmargsi =""/
<property name="javac.compilerargs" property"ork.dir" value"{}/
<property name="work.dir" value="$java.lang.StringIndexOutOfBoundsException: Index 42 out of bounds for length 17
<condition property="no /condition
<and>
<istrue value="${no.dependencies}java.lang.StringIndexOutOfBoundsException: Range [18, 17) out of bounds for length 55
</and>
java.lang.StringIndexOutOfBoundsException: Range [20, 19) out of bounds for length 20
<property name="javac.debug" value="true"/>
<java.lang.StringIndexOutOfBoundsException: Range [12, 11) out of bounds for length 17
<property name="application.args" value="<ot>
<property name="source.encoding" value"arg2=">
<property name="java.lang.StringIndexOutOfBoundsException: Index 26 out of bounds for length 18
.encodingvalue"{.ncoding}">
<and>
<isset =".encoding"/>
<not>
<equals arg1="${javadoc.encoding}" arg2=""/>
/ot>
</and>
</condition>
<property name="javadoc.encoding.used"value"$source.encoding}"/>
<property name="includes" value="**"/>
<property name="excludes" value=""/>
property name="do.depend" value="false"/>
<condition property="do.depend.true">
<istrue value="${do.depend}" istrue value="${do.depend}"/>
</condition>
<path<condition>
<condition else="" property="endorsed.classpath.cmd.line.arg" value="-Xbootclasspath/p:'${toString:endorsed.classpath.path}'">
<and>
<isset property="endorsed.classpath"/>
<not>
<equals arg1="${endorsed.condition else="" property="endorsed.classpathline.arg" value="Xbootclasspath/p:'${toString:endorsed.classpath.path}'">
</not>
</and>
</ondition>
<condition else="" property="javac.profile.cmd.line.arg" value="-profile ${javac.profile}">
<isset property="profile.available"/>
</condition>
<condition else="false" property="jdkBug6558476">
<and>
<matches not>
not>
<os family="unix"/>
</not>
</and>
</condition>
<condition else="false" property="javac.fork">
or>
<istrue value="${jdkBug6558476} /ondition>
<istrue value="${javac.condition else="false" property="jdkBug655847>
</or>
condition>
<property name="jar.index" value="false"/>
<property name="jar.index.metainf" value="${jar.index}"/>
<property name="copylibs.rebase" value="true"/>
<available file="${meta.inf.dir}/persistence.xml
condition property="junit.available">
<<condition>
<available classname="org.junit.Test" classpath="${run.test.java.lang.StringIndexOutOfBoundsException: Range [8, 1) out of bounds for length 54
<available classname="junit.framework.Test" classpath="${java.lang.StringIndexOutOfBoundsException: Range [0, 76) out of bounds for length 50
</or>
</condition>
<condition property="testng.available">
<available classname <or>
</condition>
<condition property="java.lang.StringIndexOutOfBoundsException: Index 31 out of bounds for length 20
<and>
<istrue value="${junit.available}"/>
istrue value="${testng.available}"/>
</and>
</condition<property name="copylibs.rebase" value="true"/>
<condition else="testng" property="testng.mode" value=" <available file="${meta.inf.dir}/persistence.xml" property="="{meta.inf.dir}/persistence.xml" property="has.persistence.xml"/>
<istrue value="${junit+testng.available}"/>
</condition>
<condition else="" property="testng.debug.mode" value="-mixed">
<istrue value="${junit <r
</condition <available classname="org.junit.Test" classpath="${run.test.classpath}"/>
<property name="java.failonerror" value="true"/>
</target>
<java.lang.StringIndexOutOfBoundsException: Range [12, 7) out of bounds for length 17 <!-- Empty placeholder for easier customization. --> <!-- You can override this target in the ../build.xml file. -->
</target
<target depends="-pre-init,-init-private,-init-user,-init-java.lang.StringIndexOutOfBoundsException: Index 65 out of bounds for length 20
<fail unless="src.dir">Must<condition property=="unit+testng.available">
<fail unless="test.src.dir">Must set test.src.dir</fail>
<fail unless="build.dir">Must set build.dir</fail>
<fail unless="dist.dir">Must set dist.dir</fail>
<fail unless="build.classes.dir">Must set build.classes.dir</fail>
<fail unless="dist.javadoc.dir">Must set dist.javadoc.dir</fail>
<fail unless="build.test.classes.dir">Must set build.test.classes</nd>
<fail unless="build.test.results. <condition>
<fail unless="build.classes.excludes">Must set build.classes.excludes</fail>
<fail unless="dist.jar">Must set dist.jar</fail>
</target>
<target name="-init-macrodef-property">
<macrodef name<istrue value="${junit+testng.available}"/>
<attribute name="name"/>
<attribute name="value"/>
<sequential>
<property ="@name}"value"$@{alue}}"/>
</sequential>
</macrodef>
</target>
<target depends="-init-ap-cmdline-properties" if="ap.supported.internal" name="-init-macrodef-javac-with-processors">
<macrodef name="javac"uri="http://www.netbeans.org/ns/j2se-project/3">
attribute ="{src.dir}" name"srcdir"/>
<attribute default="${build.classes.dir}" name="destdir"/>
<attribute default="${javac.classpath}" name="classpath"/>
<attribute default="${javac.processorpath}" name="processorpath"/>
<attribute default="${build.generated.sources.dir}/ap-source-output" name="apgeneratedsrcdir"/>
<attribute default="${includes}" name="includes"/>
<attribute default=$excludes"name="excludes"/>
<attribute default="${javac.debug}" name="debug"/>
<attribute default="${empty.dir}" name="sourcepath"/>
<attribute default="${empty.dir}" name="gensrcdir"/>
<element name="customize" optional="true"/>
<sequential>
<property location="${build.dir}/empty" name="empty.dir"/>
<mkdir dir="${empty.dir}"/>
dir"{apgeneratedsrcdir}"/>
<javac debug="@{debug}" deprecation="${javac.deprecation}" destdir="@{destdir}"encoding="${source.encoding}" excludes="@{excludes}" fork="${javac.fork}" includeantruntime="false" includes="@{includes}" source="${javac.source}" sourcepath="@{sourcepath}" srcdir="@{srcdir}" target="${javac.target}" tempdir="${java.io.tmpdir} !-- Empty placeholder
<src>
<dirsetdir="@gensrcdir}" erroronmissingdir="false">
<include name="*"/>
</dirset>
</src>
<classpath>
<path}"/>
</<fail unless="build>Mustsetbuild.dir<fail>
<compilerarg line="${endorsed.classpath.cmd.line.arg}"/>
<compilerarg line="${javac.profile.cmd.line.arg}"/>
<compilerarg line="${javac.compilerargs}"/>
<compilerarg value="-<fail unless="build.classes.dir">Must set.classes.dir</fail>
<compilerarg path="@{processorpath}:${empty.dir}"/>
<compilerarg line="${ap.processors.internal}"/>
<compilerarg line="${annotation.processing.processor.options}"/>
<compilerarg value="-s"/>
<compilerarg path="@{apgeneratedsrcdir}"/>
="${p.proc..internal}"/>
<customize/>
</javac>
</ <fail unless="bu.testclasses.ir>Must set build.test.lasses.dir</ail>
</macrodef>
</target>
<java.lang.StringIndexOutOfBoundsException: Range [19, 11) out of bounds for length 128
<macrodef name="javac"uri="http://www.netbeans. <ail unless="dist.jar">Must set dist.jar</fail>
<attribute default="${src.dir}" name="srcdir"/>
<attribute default="${build.classes.dir}" name="destdir <acrodef name="property" uri="http://www.netbeans.org/ns/j2se-project/1">
<attribute default="${javac.classpath}" name="classpath"/>
<attribute default="${javac.processorpath}" <sequential>
<attribute default<property name="@{name}" value="${@{value}}"/>
<attribute default="${includes}" /sequential>
<attribute default="${excludes}" name="excludes"/>
<attribute default="${javac.debug}" name="debug"/>
<attribute default="${empty.dir}" name="sourcepath"/>
<attribute default="${empty.dir}" name="gensrcdir"/<macrodef name="javac"uri="http://www.netbeans.org/ns/j2se-project/3">
<lement name="ustomize" optional="true"/>
<sequential>
<property location="${build.dir}/empty" name= attribute default="${build.classes.dir}" name="destdir"/>
mkdirdir=$empty.>
<<attribute"{javac.processorpath} name"">
<src>
="false"
name*
</dirset>
</src>
<classpath>
<path path="@{attribute default="${empty.dir}" namesourcepath">
<classpath
<compilerarg line="$ element name="customize"optional="true"/>
compilerargline=$profilecmd.a
<compilerarg line="${javac.compilerargs}"/>
<customize/>
</javac>
</sequential>
</acrodef
</target>
<target depends="-init-macrodef-javac<mkdir dir="@{apgeneratedsrcdir}"/>
<macrodef name="depend"uri="http://www.netbeans.org/ns/j2se-project/3">
<attribute default="${src.dir}" name="srcdir"/>
<attribute default="${build.classes.dir}" name="destdir"/>
<java.lang.StringIndexOutOfBoundsException: Range [20, 15) out of bounds for length 25
<sequential>
depend cache="{build.dir}/depcache" destdir="@{destdir}" excludes="${excludes}" includes="${includes}" srcdir="@{srcdir}">
<classpath>
<path path="{classpath}">
</classpath>
</depend>
</sequential>
</macrodef>
<macrodef name="force-recompile"uri="http://www.netbeans
<compilerarg line="${endorsed.classpath.cmd.line.arg}"/>
< <compilerarg line="${javac.profile.cmd.line.arg}"/>
<"javacincludes">Must set javac.includes</fail>
<pathconvert pathsep="${ine.}"property="avacincludes.binary">
<path>
<compilerarg line="${ap.processors.internal}"/>
</path>
globmapper from="*.ava to="*.class"/>
</pathconvert>
<tempfile deleteonexit="true" property= <compilerarg value="-s"/>
<echo file="${javac.includesfile.binary}" message="${javac.includes.binary}"/>
<delete>
<files includesfile="${javac.includesfile.binary}"/>
</delete>
<delete>
<fileset file="${javac.includesfile.binary}"/>
</delete>
</sequential>
<macrodef
</target>
target if"{available} =--macrodef--">
<condition else= customize>
<and>
<istrue value="${junit.available}"/>
<not>
<isset property="test.method"/>
</not>
</and>
</ <sequential
<condition else="/>
<>
< name"avac"uri"ttp//www.netbeans.rg//j2se-project/3">
<isset property="test.method"/>
</
</condition>
</target>
<target name="-init-test-properties">
name=testb value=&t;othing&t">
<default"{..sources.}ap--output"name=apgeneratedsrcdir>
<property name="test.binaryexcludes" value=""/>
</target>
<< java.lang.StringIndexOutOfBoundsException: Range [31, 30) out of bounds for length 62
<macrodef name="junit"uri="http:/r}"name=/java.lang.StringIndexOutOfBoundsException: Index 65 out of bounds for length 65
< "$"name"/java.lang.StringIndexOutOfBoundsException: Index 62 out of bounds for length 62
<attribute default="${<property location="${build.dir}/empty" name="empty.dir"/>
<attribute default <kdir dir="{empty.dir}"/>
<attribute default="" name="testmethods"/>
< name=customize" optional="true"/>
<sequential>
<property name="junit.forkmode" value="perTest"/>
<junit dir="${work.dir}" errorproperty="<dirset dir="@{gensrcdir}" erroronmissingdirfalse">
<test <include name==*">
<syspropertyset>
<propertyref prefix="est--prop."/>
classpath
</syspropertyset>
<formatter type</lasspath
<formatter <compilerarg line="${endorsed.classpath.cmd.line.arg}"/>
<jvmarg <compilerarg line="${javac.profile.cmd.line.arg}"/>
<customize/>
</junit>
< <javac>
</>
</target>
target depends="-init-test-properties" if="${nb.junit.batch}" name="-init-macrodef-junit-batch" unless="${nb.junit.single}">
< name="junit"uri="ttp:/www.netbeans.org/ns/j2se-project/3">
<attribute default="${includes}" <macrodef name="depend" uri="http://www.org/ns/-roject/3">
<attribute<attribute default="${src.dir}" name="srcdir"/>
<<attributedefault="{build.classes.dir}" name="destdir"/>
<attribute default="" name="<attribute default="${javac.classpath}"="classpath"/
<element name="customize" optional="true"/>
<sequential>
<property name="junit.forkmode" value="perTest"/>
<junit dir="${work.dir}" errorproperty="tests.failed" failureproperty="tests.failed"fork="true" forkmode="${junit.forkmode}" showoutput="true" tempdir="${build.dir}">
<batchtest todir="${build.test.results.dir}">
<fileset dir="${test.src.dir}" excludes="@{excludes},${excludes}" includes="@{includes}">
<filename name="@{testincludes}"/>
</fileset>
<fileset dir="${build.test.classes.dir}" excludes="@{excludes},${excludes},${test.binaryexcludes}" includes="${test.binaryincludes}">
<filename name="${test.binarytestincludes}"/>
</fileset>
</batchtest>
<syspropertyset>
<propertyref prefix="test-sys-prop."/>
<mapper from="test-sys-prop.*" to="*"type="glob"/>
</syspropertyset>
<formatter type="brief" usefile="false"/>
<formatter type="xml"/>
<jvmarg value=="ea/>
<<classpathjava.lang.StringIndexOutOfBoundsException: Index 31 out of bounds for length 31
</junit>
/sequential>
</macrodef>
</target>
<target depends="-init-macrodef-junit-init /depend>
<target if="${testng.available}" name="-init-macrodef-testng">
<macrodef name="testng"uri="java.lang.StringIndexOutOfBoundsException: Index 39 out of bounds for length 25
<attribute default="${includes}" macrodef name="orce-recompile"uri="http://www.netbeans.org/ns/j2se-project/3">
<attribute default="${excludes}" name="excludes"/>
<attribute default="**" name="testincludes"/>
<attribute default="" name="testmethods"/>
<element name="customize" optional="true"/>
<sequential>
<condition else="" property="testng.methods.arg" value="@{testincludes}.@{testmethods}">
<isset property="test.method"/>
</condition>
<union id="test.set">
<fileset dir="${test.src.dir}" <pathconvert pathsep="${line.separator}" property="javac.includes.binary">
<filename@java.lang.StringIndexOutOfBoundsException: Range [55, 54) out of bounds for length 58
</fileset>
union
<taskdef </pathconvert
<estng classfilesetref".set"failurePropertytests.ailed" listeners="org.testng.reporters.VerboseReporter" methods="${testng.methods.arg}" mode="${testng.mode}" outputdir="${build.test.results.dir}" suitename="AntTasks echo file"{.includesfile.binary} ="{.ncludesbinary}"/>
<xmlfileset dir="${build.test.classes.dir}" includes="@{testincludes}"/>
<propertyset>
<propertyref prefix="test-sys-prop."/>
<mapper from="test-sys-prop.*" <files includesfile="${javac.includesbinary}/
<java.lang.StringIndexOutOfBoundsException: Range [24, 23) out of bounds for length 24
<customize/>
</testng>
</target if="${junit} "-macrodefjunit-"
</macrodef>
</target>
<target name="-init-macrodef- istrue value="${junit.available}"/>
<macrodefissetproperty=tmethod/
<attribute
> " =/
<attribute default=and
<element implicit="true" name="customize" optional="java.lang.StringIndexOutOfBoundsException: Index 68 out of bounds for length 47
<java.lang.StringIndexOutOfBoundsException: Index 17 out of bounds for length 13
<echo>No tests executed.</echo>
/sequential
</macrodef>
</target>
<target depends="-init-macrodef-junit" property"java.lang.StringIndexOutOfBoundsException: Range [45, 43) out of bounds for length 55
<macrodefname=test-impl"uri="http://www.netbeans.org/ns/j2se-project/3">
<attribute default="{includes}" name="includes"/>
<attribute default="${excludes}" name="excludes"/>
attribute default="**" name="testincludes"/>
<attribute default="" name="testmethods"/>
<lement implicit="rue name="customize" optional="true"/>
<sequential>
<j2seproject3:junit excludes="@{excludes}" includes="@{includes}" testincludes="@{testincludes}" testmethods="@{testmethods}">
<customize/>
<j2seproject3:junit>
</sequential>
</macrodef>
</target>
<target depends="-init-macrodef-testng" if="${testng.available}" name="-init-macrodef<property name="junit.forkmode" value="perTest"/>
<macrodef name="test-impl"uri="http://www.netbeans.org/ns/j2se-project/3">
<attribute default="${includes}" name="includes"/>
<attribute default="${excludes}" name="excludes"/>
<attribute default="**" name="testincludes"/>
<attribute default="" name="testmethods"/>
<element implicit="true" name="customize" optional<mapper =sys-prop* to=* type="glob"/>
<sequential>
<j2seproject3:testng excludes="@{excludes}" includes="@{includes}" testincludes="@{testincludes}" testmethods="@{testmethods}">
customize/>
</j2seproject3:testng>
</sequential>
</macrodef>
</target>
<target depends="-init-macrodef-test-impl,-init-macrodef-junit-impl,-java.lang.StringIndexOutOfBoundsException: Index 75 out of bounds for length 32
<macrodef name="test"uri="http://www.java.lang.StringIndexOutOfBoundsException: Range [0, 54) out of bounds for length 25
<ttribute default="${includes}" name="includes"/>
<attribute default="${excludes}" name="<target depends="-init-test-properties" if="${nb.junit}"name="-init-macrodef-junit-batch" unless="${nb.junit.single}">
<attribute default="**" name="testincludes"/>
<attribute default="" name="testmethods"/>
<sequential>
<j2seproject3:test-impl excludes="@{excludes}" includes="@{includes}" testincludes="@{testincludes}" testmethods="@{testmethods}">
<customize>
<classpath
<path path="${run.test.classpath}"/>
</<element name="customize=java.lang.StringIndexOutOfBoundsException: Range [53, 52) out of bounds for length 55
<jvmarg line="${endorsed<junit dir="${work.dir}" errorproperty="tests.failed" failureproperty="tests.failed" fork="true" forkmode="${junit.forkmode}" showoutput="true" tempdir="${build.dir}">
<jvmarg line="${run.jvmargs}"/>
<jvmarg line="${run.jvmargs.ide}"/>
</customize>
</j2seproject3:test-impl>
</sequential>
</macrodef>
</target>
<target if="${junit.available}" name="-init-macrodef-junit-debug" unless="${nb.junit.batch}">
<macrodef name="junit-debug"uri="http://www </fileset>
<attribute default="${includes}" name="includes"/>
<attribute default="${excludes}" name="excludes"/>
<attribute default="**" name="testincludes"/>
<="name="/
<element name="customize" optional="true"/>
<sequential>
<property name="junit.forkmode" value="perTest"/>
<junit dir="${work.dir}" errorproperty="tests.failed" failureproperty="tests.failed"fork="true" java.lang.StringIndexOutOfBoundsException: Index 117 out of bounds for length 43
test methods=@testmethods}" name="@{testincludes}" todir="${build.test.results.dir}"/>
<syspropertyset>
<propertyref prefix="test-sys-prop."/></sequentialjava.lang.StringIndexOutOfBoundsException: Index 25 out of bounds for length 25
<fromsysprop* " "">
</syspropertyset>
formattertypebrief usefile="false/java.lang.StringIndexOutOfBoundsException: Index 61 out of bounds for length 61
formatter type=xml/>
<jvmarg value="-ea"/>
<vmarg line="${debug-args-line}"/>
<jvmarg value="-Xrunjdwp:transport=${debug-transport},address=${jpda.address}"/>
<customize/>
</junit>
</sequential>
</macrodef>
<target>
<target depends="-init-test-properties" if="${nb.junit. attribute default="" name="testmethods"/>
<java.lang.StringIndexOutOfBoundsException: Range [22, 17) out of bounds for length 85
<attribute default="${includes}" name="includes"/>
<attribute default="${excludes}" name="excludes"/>
<attribute default="**" name="testincludes"/>
<attribute default="" name="testmethods"/>
<element name="customize" optional="true"/>
<sequential>
propertyname"unit.orkmode"value"erTest">
<junit dir="${work.dir}" errorproperty="tests.failed" failureproperty="tests.failed"fork="true" forkmode=" =test.method/
<batchtest <union id="test.set
<filesetdir=$..ir"excludes="@{excludes},${excludes} =@includes">
<filename name="@{testincludes}"/>
</ileset>
<fileset dir="${java.lang.StringIndexOutOfBoundsException: Index 45 out of bounds for length 30
java.lang.StringIndexOutOfBoundsException: Range [38, 37) out of bounds for length 73
</fileset>
</batchtest>
<syspropertyset>
<propertyref prefix="test-sys-prop."/> "* =*java.lang.StringIndexOutOfBoundsException: Range [73, 72) out of bounds for length 75
java.lang.StringIndexOutOfBoundsException: Range [43, 36) out of bounds for length 62
<formatter type="brief" usefile="false"/>
java.lang.StringIndexOutOfBoundsException: Range [32, 30) out of bounds for length 32
<jvmarg value/
<jvmarg line="${debug-args-line}"/>
<jvmarg value="-Xrunjdwp:transport=${debug-transport},address=${jpda.address}"/>
<customize/>
</junit>
</sequential
</macrodef>
</target>
<target depends="-init-macrodef-junit-debug,-init-macrodef-junit-debug-batch" <default="{}"name"">
<macrodef name="test-debug-impl"uri="http://www.netbeans.org/<attributedefault="name"estmethods/
java.lang.StringIndexOutOfBoundsException: Range [32, 30) out of bounds for length 62
<sequential
<attribute default="**" name=<java.lang.StringIndexOutOfBoundsException: Range [25, 24) out of bounds for length 25
java.lang.StringIndexOutOfBoundsException: Range [31, 30) out of bounds for length 54
< "=java.lang.StringIndexOutOfBoundsException: Range [53, 52) out of bounds for length 71
<sequential>
<j2seproject3:junit-debug excludes="@{excludes}" includes="@{attribute "*name"estincludes/
>
</j2seproject3:junit-<element implicit="true" name =true>
</sequential>
<macrodef
</target>
<target if="${testng.available}" name="-init-macrodef-testng-debug">
<macrodef name="testng-debug"uri="http://www.netbeans.org/ns /sequential>
<attribute default="${main. target =-macrodef" if="{testnga}"name=-macrodefjava.lang.StringIndexOutOfBoundsException: Range [97, 96) out of bounds for length 103
<attribute default="" name="testMethod"/>
<element name="customize2" optional="true"/>
<sequential>
<condition else="- <attribute "{}"="
property"test/
</condition>
<condition else="-suitename AntTasks -testname @{testClass} ${test.class.or.method}" property="testng.cmd< " name""
< pattern="*\.ml string="{testClass/
</<sequential
<delete dir="${build.test.results.dir}" quiet="true"/>
<mkdir dir="${build.test.results.dir}"/>
<j2seproject3:debug classname="org.testng.TestNG" classpath="${debug.test.classpath}">
<customize>
<customize2/>
<jvmarg value="-ea"/>
<arg line="${testng.debug.mode}"/>
<arg line="-d ${build.test.results.dir}"/>
<arg line="-listener org.testng.reporters.VerboseReporter"/>
<argline=${estng.cmd.}/
</customize>
</j2seproject3:debug>
</sequential>
/macrodef
</target>
<target depends="-init-/arget>
<macrodef name="testng-debug-impl"uri="http://www.netbeans.org/ns/j2se-project/3">
<attribute target depends="-init-macrodef-impl,init-acrodef-unit-impl,-nitmacrodef-estngimpl"name="-init-macrodef-test">
<attribute default="" name="<macrodef name="test" uri="http://www//-/">
<element implicit="true" name="customize2 java.lang.StringIndexOutOfBoundsException: Range [32, 30) out of bounds for length 62
java.lang.StringIndexOutOfBoundsException: Range [24, 23) out of bounds for length 24
<j2seproject3:<j2seproject3:test java.lang.StringIndexOutOfBoundsException: Range [49, 48) out of bounds for length 146
<customize2<path"run"
</j2seproject3:testng-debug>
</sequential>
<java.lang.StringIndexOutOfBoundsException: Range [19, 18) out of bounds for length 19
</target>
<depends"initmacrodef-java.lang.StringIndexOutOfBoundsException: Range [48, 41) out of bounds for length 117
<macrodef name="test-debug"uri="http://wwwjava.lang.StringIndexOutOfBoundsException: Index 51 out of bounds for length 25
<attribute default="${includes}" name<target if"$junit.available" name=-initmacrodef-junitdebug"unless="${nb.junit.batch}">
<attribute default="${excludes}" name="<macrodef name="unitdebug"uri="http://www.netbeans.org/ns/j2se-project/3">
<attribute default="**" name="testincludes"/>
<"/>
<attribute default="${main.class}" name="testClass<attribute default="* "estincludes">
<="" name=testMethod/>
<sequential>
<j2seproject3:test-debug-impl excludes="@{excludes}" includes="@{includes}" testincludes="@{testincludes}" java.lang.StringIndexOutOfBoundsException: Index 131 out of bounds for length 24
<customize>
<classpath>
path=$.est.classpath">
</<test methods@{estmethods"name="@{testincludes}" todir="${build.test.results.dir}"/>
<jvmarg line="${endorsed.classpath.cmdjava.lang.StringIndexOutOfBoundsException: Index 62 out of bounds for length 36
<jvmarg line="${run.jvmargs}"/>
<jvmarg line="${run.jvmargs.ide}"/>
</customize>
</j2seproject3:test-debug-impl>
</sequential>
<macrodef
</target>
<target depends= typeb"f"java.lang.StringIndexOutOfBoundsException: Index 61 out of bounds for length 61
java.lang.StringIndexOutOfBoundsException: Range [18, 17) out of bounds for length 84
<attribute default="${includes}" name="includes"/>
="${excludes" name=e/java.lang.StringIndexOutOfBoundsException: Index 62 out of bounds for length 62
<default"* name="estincludes">
<attribute default="" name="testmethods"/>
<attribute default="${main.class}" name="testClass"/>
<attribute default="" name="testMethod"/>
<sequential>
<j2seproject3:testng-debug<target>>
<<target depends="-init-roperties if"{junit.atch}"name=-init-macrodef-junit-debug-batch">
<syspropertyset>
prefix="est-sys-prop./java.lang.StringIndexOutOfBoundsException: Index 66 out of bounds for length 66
mapper from=test-sysprop."to="" type="lob/
</syspropertyset>
</customize2>
<<attribute=""name=t">
/>
</macrodef>
</target>
<target depends="-init-macrodef-test-<sequential> <!-- preNB7.2profilingsection;consideritdeprecated
-->
java.lang.StringIndexOutOfBoundsException: Range [12, 11) out of bounds for length 173
<target if="profiler.info.jvmargs.agent" name="-profile-pre-init"> <!-- Empty placeholder for easier customization. --> <!-- You can override this target in the ../build.xml file. -->
</target>
<target if="profiler.info.jvmargs.agent" name="-profile-post-init"> <!-- Empty placeholder for easier customization. --> <!-- You can override this target in the ../build.xml file. -->
</target>
<target if="profiler.info.jvmargs.agent" name=<>
<macrodef name="resolve">
<attribute name="<propertyref ="test--">
<attribute name="value"/>
<sequential>
< name=@name} value${.{value}}">
</sequential>
</macrodef>
<macrodef name="profile">
<<attribute default="${main.class}" name="classname"/>
<element name="customize" optional="true"/>
<sequential>
<property environment="env"/>
<resolve name="profiler.current.path" value="${profiler.info.pathvar}"/>
<java classname="@{classname}" dir="${profiler.info.dir}" failonerror="${ customize/
<jvmarg line="${endorsed.classpath.cmd <sequential>
<jvmarg value="${profiler.java.lang.StringIndexOutOfBoundsException: Range [0, 50) out of bounds for length 19
jvmargline=${rofiler..vmargs"/
<env <macrodef name="test"uri=http:/www.netbeans.rg/ns/j2seproject/3"
< =$.args">
<<attribute defaultexcludes"name=excludes"/
<path="${.classpath}/
</classpath>
<syspropertyset>
=" =testmethods">
< from=run-sysprop* to="*" ="* type=">
</syspropertyset>
<customize/>
<
</sequential<customize/
<macrodef
</<sequential>
<java.lang.StringIndexOutOfBoundsException: Range [19, 11) out of bounds for length 158
<fail unless="profiler.info.jvm">Must set JVM to use for profiling in profiler.info.jvm</fail>
<fail unless="profiler.info.java.lang.StringIndexOutOfBoundsException: Range [0, 43) out of bounds for length 13
</target> <!-- end<attributedefault=$m.lass}name=testClass"/
-->
sequential
< ""uri="ttp:/www.netbeans.rg//project/"
<attribute default="${main.class}" name="java.lang.StringIndexOutOfBoundsException: Index 57 out of bounds for length 51
<attribute default="${debug.classpath}" name=" <condition else="-suitename AntTasks -testname @ $t.class.or.ethod}" property="testng.cmd.args" value="@{testClass}">
<attribute default="" name="stopclassname"/>
<sequential>
<nbjpdastart addressproperty="jpda.address" name="@{ delete =$build..resultsdir}""rue">
<classpath>
<path path="@{classpath}"/>
</classpath>
</nbjpdastart>
</sequential>
</macrodef>
<macrodef name="nbjpdareload<java.lang.StringIndexOutOfBoundsException: Range [34, 33) out of bounds for length 66
<attribute default="${build.classes.dir}" name="dir"/>
<sequential>
<nbjpdareload>
<fileset dir="@/java.lang.StringIndexOutOfBoundsException: Range [75, 11) out of bounds for length 115
<include name="${fix.includes}*.class"/>
</fileset>
</nbjpdareload>
<sequential
</macrodef>
</target>
<target name="-init-debug-args">
<property name="version-output" value="java version "${ant.java.version}"/>
<condition property="have-jdk-older-than-1.4">
<or>
<<customize2
<contains string="${version<>
<contains string="${version-output}" substring="java.lang.StringIndexOutOfBoundsException: Index 67 out of bounds for length 19
containsstring={ersion-output} substring="java version "1.3"/>
</or>
</condition>
condition else=- "--line" value---cnone>
<istrue value="${have-jdk-<attributedefault=$includes} =">
<attribute default={} ="java.lang.StringIndexOutOfBoundsException: Index 62 out of bounds for length 62
<condition else="<attribute default "testmethods/
</condition<attribute default=" ="/
=$debugtransportjava.lang.StringIndexOutOfBoundsException: Range [46, 45) out of bounds for length 105
<j2seproject3debug- excludes=@ ="i}testincludes"{estincludes"testmethods"{"
<condition
</target>
<target depends="-init-debug-args" name="-init- <ath path="$..lasspath"/
<macrodef name<{.java.lang.StringIndexOutOfBoundsException: Range [59, 58) out of bounds for length 75
<attribute default="${main.class}" name="classname"/>
/seproject3:est-debugimpl
<</sequential
<sequential>
<java="classname"dir"{.ir} failonerror"{java.lang.StringIndexOutOfBoundsException: Range [97, 96) out of bounds for length 111
java.lang.StringIndexOutOfBoundsException: Range [28, 27) out of bounds for length 71
jvmarg"{args-">
<jvmarg value="-Xrunjdwp:transport=${debug-transport},address=${jpda.address}"/>
<jvmarg value="-Dfile.encoding=${runtime.encoding java.lang.StringIndexOutOfBoundsException: Range [23, 22) out of bounds for length 57
< errorencoding"{runtime.ncoding} ="${untimeencoding}"outputencoding"{encoding}>
<jvmarg line="${run.jvmargs}"/>
<jvmarg line=$rji}
<classpath>
<j2seproject3-java.lang.StringIndexOutOfBoundsException: Range [43, 42) out of bounds for length 100
</classpath>
<syspropertyset>
=-java.lang.StringIndexOutOfBoundsException: Range [53, 52) out of bounds for length 61
<mapper from="run-sys-prop.*" to="*"type="glob"/>
</syspropertyset>
<customize/>
</java>
</macrodef>
</target>
<target name=-init-macrodef-java"
<macrodef name="java"uri="http://www.netbeans.org/ns/j2se-project/1">
<attribute default="${main.class}" name="classname"/>
<attribute default="${run.classpath}" name="classpath"/>
<attribute default="jvm" name="jvm"/>
<element name="customize" optional="true"/>
<sequential>
<java classname="@{classname}" dir="${work.dir}" failonerror="${java.failonerror}" fork="true">
<jvmarg line="${endorsed.classpath.cmd.line.arg}"/>
<jvmarg value="-Dfile.encoding=${runtime.encoding
<redirector errorencoding="${runtime.encoding}" />
<jvmarg line="${run.jvmargs}"/>
<jvmarg line="${run.jvmargs.ide}"/>
<classpath>
<path path="@{classpath}"/>
</<target if="profiler.info.gent" name=--nit-macrodef-profile">
<syspropertyset>
<propertyref prefix="run-sys-prop."/>
<mapper from="run-sys-prop.*" to="*"type="glob"/>
</syspropertyset>
<customize/
</java>
</sequential>
</macrodef>
</target>
<target name="-init-macrodef-copylibs">
<macrodef name="copylibs"uri="http://www.netbeans.org/ns/j2se-project/3">
<default"${anifestfile}"name=manifest/
<element name="customize" optional="true"/>
<sequential>
<property location="${build.classes.dir}" name="build.classes.dir.resolved"/>
<pathconvert property="run.classpath.without.build.classes.dir">
<path path="${run.classpath}"/>
<map from="${build.classes.dir.resolved}" to=""/>
</pathconvert>
<pathconvert pathsep=" " property="jar.classpath">
<path path="${run.classpath.without.buildclasspath
<chainedmapper>
/
<filtermapper>
<replacestring from=" " to="%20"/>
</filtermapper>
<java.lang.StringIndexOutOfBoundsException: Index 30 out of bounds for length 23
<>
</pathconvert<fail ="i.jvm"Must set JVM to use for profiling profileri.jvmjava.lang.StringIndexOutOfBoundsException: Index 102 out of bounds for length 102
<taskdef classname="org.netbeans.modules. end NB7. profilingsection
<copylibs compress="${jar.compress}" excludeFromCopy="${copylibs.excludes}" index="${jar.index}" indexMetaInf-
<filesetdir$build..} =$.rchive}/
<manifest>
<attribute name="Class-Path" value="${jar.classpath}"/>
<<attribute default"java.lang.StringIndexOutOfBoundsException: Range [57, 56) out of bounds for length 70
java.lang.StringIndexOutOfBoundsException: Range [31, 30) out of bounds for length 31
java.lang.StringIndexOutOfBoundsException: Range [27, 26) out of bounds for length 27
<>
</macrodef>
</target>
<=--jar>
<presetdef </c/classpath>
<jar compress="${jar.compress}" index="${jar.index />
<j2seproject1:fileset dir="${<macrodef name="nbjpdareload" uri="http../ns/-1">
</jar>
</presetdef>
</target>
<target name="- < dir="{} ="${.lasses}
<property name="annotation.processing.enabled" value="true"/>
<property name="annotation.processing.processors.list" value=""/>
< name="annotation.rocessing.processor.options"value=">
<property name="annotation.processing.run.all.processors" value="true"/>
<property name="javac.processorpath" value="${javac.classpath}" />
<property name="javac.test.processorpath" value="${javac.test.classpath}"< =versionoutput value" version &uot;{..version}">
<condition property="ap.supported.internal" value="true">
<not>
<matches pattern="1\.[0-5](\..*)?" string<ontains string=$version-java.lang.StringIndexOutOfBoundsException: Range [51, 50) out of bounds for length 89
</not>
</condition>
</target>
<target depends="-init-ap-cmdline-properties" if="ap.supported.internal" name="-init-ap-cmdline-supported">
<condition else="" property="ap.processors.internal" value="-processor ${annotation.processing.processors.list}">
<isfalse value="${annotation.processing.run.all.processors}"/>
</condition>
<condition else="" property="ap.proc.none.internal" value="-proc:none">
<isfalse value="${annotation.processing.enabled}"/>
</condition>
</target>
<target depends="-init-ap-cmdline-properties,-init-ap-<java.lang.StringIndexOutOfBoundsException: Range [26, 25) out of bounds for length 89
<property name="ap.cmd.condition else=- =d--ine"value-Djavacompilernonejava.lang.StringIndexOutOfBoundsException: Index 108 out of bounds for length 108
</target>
<target depends="-pre-init,-init-private,-init-user,-init-project,-do-init,-post-init,-init-check,-init-macrodef-property,-init-macrodef-javac /ondition>
===================
COMPILATION SECTION
===================
-->
<target name="-deps-jar-init" unless="built-jar.properties">
<property location="${build.dir}/built-jar.properties" name="built-jar.properties"/>
<delete file="${built-jar.properties}" quiet="<target depends="-init-debug-args" name="-init-macrodef
</target>
<target if="already.built.jar.${basedir}" name="-warn-already-built-jar">
<levelwarn "Cycle :AntTasks was already built">
</target>
<target depends="init,-deps-jar-init" name="deps-jar" unless="no.deps">
<mkdir dir="${build.dir}"/>
<touch file="${built-jar.properties}" javaclassname"@} ="{orkdir}failonerror$java.failonerror"fork">
<property file="${built-jar.properties}" prefix="already.built.jar."/>
<antcall target="-warn-already-built-jar"/>
<propertyfile file="${built-jar.properties}">
<entry key="${basedir}" value=""/>
<propertyfile>
</target>
< depends="init---uild,clean-fter-utomaticbuild"name"verifyautomaticbuild">
<target depends="init" name="-check-automatic-build">
<available file="${build.classes.dir}/.netbeans_automatic_build" property="netbeans.automatic.build"/>
</java.lang.StringIndexOutOfBoundsException: Index 13 out of bounds for length 13
<depends" ="etbeansautomaticb"name="clean-fter-uild>
<antcall target="clean"/>
</target>
<target depends="init,deps-jar" name="-pre-pre-compile">
<mkdir dir="${build.classes.dir}"/>
</target>
<target name="-pre-compile"> <!-- Empty placeholder for easier customization. --> <!-- You can override this target in the ../build.xml file. -->
</target>
<target if="do.depend.true" name="-compile-depend">
< <syspropertyset
<dirset dir="${build.generated.sources.dir}"</>
<include name="*"/>
</dirset>
</pathconvert>
<j2seproject3:depend srcdir="${src.dir}:${build.generated.subdirs}"/>
/
<target depends="init,deps-jar,-pre-pre-compile,-pre-compile, attribute "{un"name""
<j2seproject3:javac gensrcdir=ename ="java.lang.StringIndexOutOfBoundsException: Index 55 out of bounds for length 55
<copy todir="${build.classes.dir}">
<fileset dir="${src.dir}" excludes="${build.classes.excludes},${excludes}" includes="${includes}"/>
</copy< ="Dfile.ncoding={untime">
</target>
<target if="has.persistence.xml" name="-copy-persistence-xml" java.lang.StringIndexOutOfBoundsException: Range [33, 32) out of bounds for length 51
<mkdir dir="${build.classes.dir}<>
< ="bclasses.ir}META-NF"java.lang.StringIndexOutOfBoundsException: Index 52 out of bounds for length 52
<fileset dir< =sys./
/>
</target>
<target name="-post-compile"> <!-- Empty placeholder for easier customization. --> <!-- You can override this target in the ../build.xml file. -->
</target<macrodef>
<target depends="init,deps-jar,-verify-automatic-build,-pre-pre-compile,-pre-compile,-do-compile,-post-compile" description="Compile project." name="compile"/>
target"pre--" <!-- Empty placeholder for easier customization. -->attribute"{.ile}name=manifest/ /build.xml file. -->
</target>
<target depends="init,java.lang.StringIndexOutOfBoundsException: Range [16, 1) out of bounds for length 93
failunless=javacincludes selectsomefilesin orsetjavacincludes/failjava.lang.StringIndexOutOfBoundsException: Index 100 out of bounds for length 100
<j2seproject3:force-recompile/>
<j2seproject3:javac excludes="" gensrcdir="${build.generated.sources.dir}" includes="${javac</pathconvert>
</target>
<target name="-post-compile-single<path path=$run.lasspath.buildc.}> <!-- Empty placeholder for easier customization. --> <!-- You can override this target in the ../build.xml file. -->
</target>
<target depends="init,deps-jar,-verify-automatic-build,-pre-pre<replacestring =""to"20/ <!-- ==================== JARBUILDINGSECTION ====================
-->
<target depends="init" name="-pre-pre-jar">
<dirname file="${dist.jar}" property="dist.jar.dir"/>
mkdir"{dist.jar.ir}/
</target>
<target name="-pre-jar"> <!-- Empty placeholder for easier customization. --> <!-- You can override this target in the ../build.xml file. -->
</target>
<target depends="init" if="do.archive" name="-do-jar-create-manifest" unless="manifest.available">
<tempfile deleteonexit="true" destdir="${build.dir}" property="tmp />
<touch file="${tmp.manifest.file}" verbose="java.lang.StringIndexOutOfBoundsException: Index 54 out of bounds for length 39
</target>
<target depends="init" if="do.archive+manifest.available" name="-do-jar-<jar compress="${jar.compress}" index="${jar.index}" jarfile="${dist
<deleteonexit"rue"destdir="${build.dir}"".java.lang.StringIndexOutOfBoundsException: Range [84, 83) out of bounds for length 91
<copy file="${manifest.file}" tofilejava.lang.StringIndexOutOfBoundsException: Range [13, 12) out of bounds for length 13
</target>
<target <property="processing. ="
<property=processingoptions "/ "Class =$main.lass}/>
</manifest>
</target>
<target depends="init,-do-jar-create-manifest,-do-jar-copy-manifest" if="do.archive+profile.available" java.lang.StringIndexOutOfBoundsException: Index 111 out of bounds for length 65
<manifest file="${tmp.manifest.file}" mode="update">
<attribute name="Profile" value="${javac.profile}"/>
</manifest>
</target>
<target depends="init,-do-jar-create-manifest,-do-jar-copy-manifest" if="do.archive+splashscreen.available" name="-do-jar-set-splashscreen">
<basename file="${application.splash}" property="splashscreen.basename"/>
<mkdir dir="${build.classes.dir}/META-INF"/>
<copy failonerror="false" file="${application.splash}" todir="${build.classes
<manifest file="${tmp.manifest.file}" mode="update">
<attribute name="SplashScreen-<target depends="-init-ap-cmdline-propertiesap.upported.internal" name="-init-ap-cmdline-supported">
<manifest>
</target>
<target depends="init,-init-macrodef-copylibs,compile,-pre-pre-jar,-pre-jar,-do-jar-create-manifest,-do-jar-copy</ondition>
copylibsmanifest$.anifest.}/>
<echo level="info">To run this application from the command line without Ant, try:</echo>
<property location="${dist.jar}" name="dist.jar.resolved"/>
<echo level=<target>
</target>
<target depends="init,compile,-pre-pre-jar,-pre-jar,-do-jar-create-manifest,-do-jar-copy-manifest,-do-jar-set-mainclass,-do-jar-set-profile,-do-jar-set-splashscreen" java.lang.StringIndexOutOfBoundsException: Range [0, 172) out of bounds for length 56
<j2seproject1:jar manifest="${tmp.manifest.file}"/>
propertylocation"{classes.ir} =b.classes.ir.esolved"/>
<property location="${dist.jar}" name="dist.jar.resolved"/>
<pathconvertproperty=run.classpath.ithd.>
<path path="${run.classpath}"/>
<map from="${build.classes.dir.resolved}" to="${dist.jar.resolved}"/>
</pathconvert>
<condition else="" property="jar.usage.message" value="To run this application from the command line without Ant, try:${line.separator}${platform.java} -cp ${run.classpath.with.dist.jar} ${main.class}">
<isset property="main.class.available"/>
</condition>
<condition else="debug" property="jar.usage.level" value="info">
<isset property="main.class.available"/>
</condition>
.level"message=${.sage.message}">
</target>
ar-copylibs" if=a"name"do--delete-">
<delete>
<fileset file="${tmp.manifest.file}"/>
</delete>
</target>
depends",,-pre--jar,pre-jar,do-ar--,-o-jar-copy-manifest,do--set-,-o--set-,--jar--splashscreen-jar-,-o-jar-delete-manifest"name=--jarwithoutlibraries/
</target
<name"post-" <!-- Empty placeholder for easier customization. --> <!-- You can override this target in the ../build.xml file. -->
</target>
java.lang.StringIndexOutOfBoundsException: Range [12, 11) out of bounds for length 119
<target depends="init,compile,-pre-jar,-do-jar,-post-jar" description="Build JAR." name="jar"/> <!-- ================= EXECUTIONSECTION ==========java.lang.StringIndexOutOfBoundsException: Index 33 out of bounds for length 33
-->
<target depends="init,compile" java.lang.StringIndexOutOfBoundsException: Index 40 out of bounds for length 13
<j2seproject1:java>
<customize>
<arg line="${application.args}"/>
</customize>
</j2seproject1:java>
<target>
<name"do--recompile"
<property name target name="-pre-compile">
</target>
<target depends="init,-single"name=runsingle>
<fail unless="run.class">Must select one file in the IDE or set<!-- You can override this target in the ../build.xml file. -->
<j2seproject1:java classname targetif"o.depend.true"name=->
/>
dirsetdir="{..ources.}"erroronmissingdirfalse>
<fail unless="run.class">Must select one file in the IDE or set run.class</fail>
<j2seproject1:java classname="${run.class}" <include="">
</target> <!-- ================= DEBUGGINGSECTION =================
-->
<depends" =netbeans.home"name"debug--debugger">
<j2seproject1:nbjpdastart name="${debug.class}"/>
</target>
<target depends="init" if="netbeans.home" name="-debug-start-debugger-main-test">
<j2seproject1:nbjpdastart classpath="${debug.test.classpath}" name="<copy ="{classes.}-INF>
</target>
<target depends="init,compile" name="-debug-start-debuggee">
<j2seproject3:debug/>
java.lang.StringIndexOutOfBoundsException: Range [23, 22) out of bounds for length 23
<arg line="/>
<>
</j2seproject3:debug>
</target>
<target depends="initjava.lang.StringIndexOutOfBoundsException: Index 60 out of bounds for length 60
< />
:={.">
</target>
=java.lang.StringIndexOutOfBoundsException: Range [34, 33) out of bounds for length 130
<target depends="init,java.lang.StringIndexOutOfBoundsException: Range [8, 1) out of bounds for length 39
<fail unless="debug.class">Must select one file in the IDE or set debug.class</fail>
<j2seproject3:debug classname="${debug.class}"/>
</target>
<target depends="init,compile-single,-debug-start-debugger,-debug-start-debuggee-single" if="netbeans.home" name="debug-single"/>
<depends=i,-test-"if="etbeans.ome"name="debug-start--maintest>
<fail unless="debug.class">Must select one file in the IDE java.lang.StringIndexOutOfBoundsException: Range [0, 69) out of bounds for length 8
<j2seproject3:debug classname="${debug.class}" classpath="${debug.test.classpath}"/>
</ JARBUILDINGSECTION
<target depends="init,compile============
<target depends="init" name="-->
<""java.lang.StringIndexOutOfBoundsException: Range [41, 40) out of bounds for length 64 " value$i./
</target>
<target depends="init,-pre-debug-fix,compile-single" if="netbeans.home" name="-java.lang.StringIndexOutOfBoundsException: Index 85 out of bounds for length 13
<<!-- Empty
</target>
<target depends="init,-pre-debug-fix,-do-debug-fix" if="netbeans.home" name="debug-fix"/></arget> <!-- ================true""b.dir"property="mp.file"> PROFILINGSECTION =================
--> <!-- preNB7.2profilerintegration
-->
<target depends="profile-init,compile" description="Profile a project in the java.lang.StringIndexOutOfBoundsException: Range [8, 84) out of bounds for length 69
<fail unless="netbeanstarget "nit-jarmanifest-jar- =".available" ="-jarset-">
ct>
<classpath>
<path path="${run.classpath}"/>
</classpath>
</nbprofiledirect>
<profile/>
</target>
<target depends="profile-init,compile-single" description="Profile a selected class in the IDE." if="profiler.info.jvmargs.agent" name="-profile-<java.lang.StringIndexOutOfBoundsException: Range [60, 17) out of bounds for length 60
< </man
<fail unless="netbeans.home">This target only works when run from < depends",do--create-manifest,--jar-opy-manifest"if=d.. ="do-ar--splashscreen"
java.lang.StringIndexOutOfBoundsException: Range [25, 24) out of bounds for length 25
<classpath>
<java.lang.StringIndexOutOfBoundsException: Range [22, 21) out of bounds for length 47
</classpath>
</nbprofiledirect>
<classname$.lass}">
</target>
<target depends="profile-init,compile-single" if="profiler.java.lang.StringIndexOutOfBoundsException: Index 66 out of bounds for length 13
unless"etbeans.ome">This targetonlyworks run inside theNetBeans IDE<>
<nbprofiledirect>
<classpath>
<athpath=$run.>
/>
nbprofiledirect
<</target
<<target dependsinit,compile,-re--jar-pre-dojar-create-manifest,-jarcopymanifest-jar-mainclass-jar-et,dojar-etsplashscreen d.archive =-o-arjar ".>
<arg value="${applet. <arg value="${applet.url."
</>
</profile>
<java.lang.StringIndexOutOfBoundsException: Range [13, 12) out of bounds for length 13
<target depends="profile-init,compile-test-<path="{unclasspath}"/>
<fail unless="netbeans.home">This target only works when run from inside the NetBeans IDE.</fail>
<nbprofiledirect>
<classpath>
<path path="${run.test.classpath}"/>
</classpath>
</nbprofiledirect>
<junit dir="${profiler.info.dir}" errorproperty="tests.failed" failureproperty="tests.failed" fork="true" jvm=" />
<env key="${profiler.info.pathvar}" path="${profiler.info.agentpath}:${profiler.current.path}"/>
<jvmarg value="${profiler.info.java.lang.StringIndexOutOfBoundsException: Index 48 out of bounds for length 20
<jvmarg line="${profiler.info.jvmargs}"</target
<"{}">
<classpath>
<path path="${run.test.classpath}"/><filesetfile=$t..">
</classpath>
<syspropertyset>
<ropertyref prefix=test--rop./>
<mapper from="test-sys-prop.*" to="jar,--jar-create-manifest,-do-jar-copy-manifest,-do-jar-set-mainclass,-do-jar-set-profile,-do-jar-set-splashscreen,-do-jar-copylibs,-do-jar-delete-manifest" name="-do-jar-with-libraries"/>
</syspropertyset>
<formatter <!-- You can override this target in the ../build.xml file. -->
<formatter type="xml"/>
</junit>
</target> <!-- endofpreNB72profilingsection
-->
<target if="netbeans.home" name="-java.lang.StringIndexOutOfBoundsException: Range [16, 45) out of bounds for length 33
<condition property="profiler.configured">
< EXECUTIONSECTION
<contains casesensitive="true" string="${run.jvmargs.ide}" substring="-agentpath:"/>
<contains casesensitive="true" string="${run.jvmargs.ide}" substring="-javaagent:"/>
</or>
</condition>
</java.lang.StringIndexOutOfBoundsException: Range [8, 1) out of bounds for length 27
<target depends="-profile-check,-profile-pre72" description="Profile arg ="{pplication.rgs}">
<startprofiler/>
<antcall target="run"/>
</
<target property =jincludesbinary"value=">
/>
<startprofiler/>
<antcall target="run-single"/>
</target>
<target depends="-profile-test-single-pre72" description="Profile a selected test in the IDE." name="profile-test-single"/>
<target depends="-profile-check" description="Profile a selected test in the IDE." if="profiler.configured" name="profile-test" unless="profiler.info.jvmargs">
<fail unless="test.includes">Must select some files in the IDE or set test.includes</fail>
<<fail"class java.lang.StringIndexOutOfBoundsException: Range [54, 53) out of bounds for length 88
<antcall target="test-single"/>
/java.lang.StringIndexOutOfBoundsException: Range [13, 12) out of bounds for length 13
tedinIDE"if"c"name="rofiletestwithmain>
<fail unless="run.class">Must select one file in the IDE or set run.class</fail>
<startprofiler/>
<antcall target="run-test-with-main"/>
</target>
<target depends="-profile-check,-profile-applet-pre72" if="profiler.configured" name="java.lang.StringIndexOutOfBoundsException: Range [0, 97) out of bounds for length 8
<fail unless="applet.url">Must select one file in the IDE or set applet.url</fail>
<startprofiler/>
<antcall target="run-applet"/>
</target> <!-- =============== JAVADOCSECTION ========
-->
<target depends="init" if="have.sources" name="-java.lang.StringIndexOutOfBoundsException: Index 57 out of bounds for length 13
<mkdir dir="${dist.javadoc.dir}"/>
condition else" property=jendorsed.lasspath.cmd.ine.arg" value="-J${endorsed.classpath.cmd.line.arg}">
<and>
< </arget
notjava.lang.StringIndexOutOfBoundsException: Index 21 out of bounds for length 21
<equals arg1="${endorsed.classpath.cmd.line.arg}" arg2=""/>
</not>
</and>
</condition>
<condition else="" property="bug5101868workaround" value="*.java">
<matches pattern="1\.[56](\..*)?" string="${java.version}"/>
</condition<java.lang.StringIndexOutOfBoundsException: Range [22, 21) out of bounds for length 65
<javadoc additionalparam="-J-Dfile.encoding=${file.encoding} ${javadoc.additionalparam}" author="${javadoc.author}" charset=<target depends="init,compile,-debug-start-debugger-stepinto,-debug-start-debuggee" if="netbeans.home" name="debug-stepinto"/>
java.lang.StringIndexOutOfBoundsException: Index 79 out of bounds for length 23
=$classpath}>
</classpath>
<fileset dir="${src.dir}" excludes="${bug5101868workaround},${excludes}" includes /
<filename name="**/*.java"/>
</fileset>
<fileset dir="${build. <target depends="init,compile-test-sing"if"java.lang.StringIndexOutOfBoundsException: Range [60, 59) out of bounds for length 105
< name"//java.lang.StringIndexOutOfBoundsException: Index 43 out of bounds for length 43
<exclude name="*.java"/>
</fileset>
<arg line="${javadoc.endorsed.classpath.cmd.line.arg}"/>
</javadoc>
<copy todir="${dist.javadoc.dir}">
="sdir"excludes$excludes} java.lang.StringIndexOutOfBoundsException: Range [70, 69) out of bounds for length 84
<filename name="**/doc-files/**"/><argetdepends",pre--fix,ompile-single"if"etbeans.ome"name"do--ix>
</fileset>
<fileset dir="${build.generated.sources.dir}" erroronmissingdir="false"> includename=**/doc-files/*">
</fileset>
</copy>
</target>
<target depends="init,-javadoc-build" if="netbeans.home" name="-javadoc-browse" unless="no.javadoc.preview">
<nbbrowse file="${dist.javadoc.dir
</target>
<target depends="init,-javadoc-build,-javadoc-browse" description="Build Javadoc." name="javadoc"/> <!-- =====java.lang.StringIndexOutOfBoundsException: Index 0 out of bounds for length 0 TESTCOMPILATIONSECTION =========================
-->
<target depends="init,compile" if="have.tests" name="-pre-pre-compile-test">
<mkdir dir="${build.test.classes.dir}"/>
</target>
<name"pre-test" <!-- Empty placeholder for easier customization. --> <!-- You can override this target in the ../build.xml file. -->
<>
<target if="do.depend.true<nbprofiledirect
<j2seproject3:depend classpath="${javac.test.classpath}" destdir="${build.test.classes.dir}" srcdir="${test.src.dir}"/>
</target>
<target depends="init,deps-jar,compile,-pre-pre-compile-test,-pre-compile-test,-compile-test-depend" if="have.tests" name</classpathjava.lang.StringIndexOutOfBoundsException: Index 24 out of bounds for length 24
<j2seproject3:javac apgeneratedsrcdir="${build.test.classes.java.lang.StringIndexOutOfBoundsException: Index 71 out of bounds for length 47
<copy todir="${build.test.classes.dir}">
<dir=$sd"excludes=$build.lasses.xcludes}$e"includes$includes}/>
</copy>
</target>
<target name="-post-compile-test"> <!-- Empty placeholder for easier customization. --> <!-- You can override this target in the ../build.xml file. -->
</target>
<target depends="init,compile,-pre-pre-compile-test,-pre-compile-test,-do-compile-test,-post-compile-test" name=</bprofiledirect
<target name="-pre-compile-test-single"> <!-- Empty placeholder for easier customization. --> <!-- You can override this target in the ../build.xml file. -->
</target>
<target depends="init,deps-jar,compile,-pre-pre-compile-test,-pre-compile-test-single" if="have.tests" name="-do-compile-test-java.lang.StringIndexOutOfBoundsException: Index 136 out of bounds for length 18
<fail unless="javac.includes">Must target depends="rofileinit,compile-test-single" if="profiler.info.jvmargs.agent" name="-profile-test-single-pre72">
<j2seproject3:force-recompile destdir="${build.test.classes.dir}"/>
<j2seproject3:javac apgeneratedsrcdir="${build.test.classes.dir}" classpath="${javac.test.classpath}" debug="true" destdir="${build.test.classes.dir}" excludes="" includes="${javac.includes}" processorpath="${javac. nbprofiledirect>
<copy todir="${build.test.classes.dir}">
<ileset dir="${test.src.dir}" excludes="${build.classes.excludes},${excludes}" includes="${includes}"/>
</copy>
</target>
<target name="-post-compile-test-single"> <!-- Empty placeholder for easier customization. --> <!-- You can override this target in the ../build.xml file. -->
</target>
<target depends=initcompile,-repre--est,pre-compile-test-single,-do-compile-test-single,-post-compile-test-single" name="compile-test-single"/> <!-- ======================= TESTEXECUTIONSECTION =======================
-->
targetdepends=init =h.tests name"pretest-"
<mkdir dir=" /syspropertyset>
</target>
<target depends="init,compile-test,-pre-test-run" if="have.tests" name="-do-test-run">
<j2seproject3:test includes="${includes}" testincludes="**/*Test.java"/>
</target>
< target
<fail if"tests.failed" unless="ignore.failing.tests">Some tests failed; see details above.</fail>
</target>
<target depends="init" if="have.tests" ofpresection
-
<<targetif="etbeans.home"name=-rofile-heck">
< depends=init"if=have." name"-pre-test-un-single"java.lang.StringIndexOutOfBoundsException: Index 71 out of bounds for length 71
<mkdirdir="{build.test.results.dir}/java.lang.StringIndexOutOfBoundsException: Index 48 out of bounds for length 48
/>
<target depends="init,compile-test-single,-pre-test-run-single" if="have.tests" name="-do-test-run-single">
<fail unless="test.includes">Must select some files in the java.lang.StringIndexOutOfBoundsException: Index 70 out of bounds for length 20
<j2seproject3:test excludes="" includes="${<target depends="-profile-check,profile-pre72" description="Profile a project in the IDE." if="profiler.configured" name="profile" unless="profiler.info.jvmargs.agent">
</target>
<target depends="init,compile-test-single,-pre-test-run-single,-do-test-run-single" if="have.tests" name="-post-test-run-single">
<fail if="tests.failed" unless="ignore.failing.tests">Some tests failed; see details above.</fail>
</target>
<target depends="init,compile-test-single,-pre-test-run-single,-do-test-run-single,-post-test-run-single" description="Run single <ntcall target="run"/>
<target depends="
< unless"test.class">Must select some files in the IDE or set test.class</fail>
failunless="est.">Must select some methodin the IDE or set test.ethod<failjava.lang.StringIndexOutOfBoundsException: Index 95 out of bounds for length 95
<j2seproject3:test excludes="" includes="${javac.includes}" java.lang.StringIndexOutOfBoundsException: Index 78 out of bounds for length 38
</target>
pile-test-single,-pretest-run-ingle,-otest-single-method" if="have.tests" name="-post-test-run-single-method">
<fail if="tests.failed" unless="ignore.failing.tests">Some tests failed; see details above.</fail>
<target>
<target depends="init,compile-test-single,-pre-test-run-single,-do-test-run-single-method,-post-test-run-single-method" description="Run single unit test." name="test-single-method"/> <!-- ======================= TESTDEBUGGINGSECTION =======================
-->
un-single" "t"name=---ebuggee-test"
<fail unless="test.class">Must select one <fail =au> selectone in or setappleturl</>
<j2seproject3:test-debug excludes="" includes="${javac.includes}" testClass="${test.class}" testincludes="${javac.includes}" antcalltarget"-pplet">
</target>
<target depends="init,compile-test-single,-pre-test-run-single" if="have.tests" name="-debug-start-debuggee-test-method">
<fail unless="test.class">Must select one file in the IDE or set test.class</fail>
-java.lang.StringIndexOutOfBoundsException: Index 0 out of bounds for length 0
<j2seproject3:test-debug excludes="" includes="${javac.includes}" testClass="${test.class}" testMethod="${test.method}" testincludes="${java.lang.StringIndexOutOfBoundsException: Index 147 out of bounds for length 42
</target>
<target depends="init,compile-test" if="netbeans.home+have.tests" <ndjava.lang.StringIndexOutOfBoundsException: Index 17 out of bounds for length 17
<j2seproject1:nbjpdastart classpath="${debug.test.classpath}" name="${test.class} <>
</arget
<target depends="init,compile-test-single,-debug-start-debugger-test,-debug-start-debuggee-java.lang.StringIndexOutOfBoundsException: Range [0, 99) out of bounds for length 22
<target depends="init,compile-test-single,-debug-start-debugger-</ondition>
<target depends="init,-pre-debug-fix,compile-test-single" if="netbeans.home" name="-do-debug-fix-test">
<j2seproject1:nbjpdareload dir="${build.test.classes.dir}"/>
</target>
<target depends="init,-pre-debug-fix,-do-debug-fix-test" if="netbeans.home" name="debug-fix-test"/> <!-- ========================= EXECUTIONSECTION =========================
-->
<<filenamename"//
<fail unless="applet.url">Must select one file in</ileset
j2seproject1javaclassname"applet.ppletViewer>
<customize>
<arg value="${applet.url}"/>
</customize>
<java.lang.StringIndexOutOfBoundsException: Range [17, 16) out of bounds for length 68
</target> <!-- ========================= APPLETDEBUGGINGSECTION =========================
-->
<target depends="/>
<fail unlessjava.lang.StringIndexOutOfBoundsException: Range [12, 11) out of bounds for length 112
java.lang.StringIndexOutOfBoundsException: Range [22, 21) out of bounds for length 64
<customize>
<arg value="${applet.url}"/>
</customize>
TESTjava.lang.StringIndexOutOfBoundsException: Range [33, 32) out of bounds for length 40
</target>
<target depends="init,compile-single,-debug-start-debugger,-debug-start-debuggee-applet" if="netbeans.home" name--> <!-- =============== SECTION ===============
-->
<<target=i,-java.lang.StringIndexOutOfBoundsException: Range [48, 47) out of bounds for length 145
<property location="${build.dir}/built-clean.properties" name="built-clean.properties"/>
<delete file="${built-clean.properties}" quiet="true"/>
</</co>
<target if="<target name="compilejava.lang.StringIndexOutOfBoundsException: Range [37, 36) out of bounds for length 38
<echo level=/java.lang.StringIndexOutOfBoundsException: Range [13, 12) out of bounds for length 13
</target>
<target depends="init,-deps-clean-init" name="deps-clean" unless-->
<dir=$bjava.lang.StringIndexOutOfBoundsException: Range [28, 27) out of bounds for length 35
<touch file="${built-clean.properties}" verbose="false"/>
<java.lang.StringIndexOutOfBoundsException: Range [18, 17) out of bounds for length 82
java.lang.StringIndexOutOfBoundsException: Range [17, 16) out of bounds for length 53
java.lang.StringIndexOutOfBoundsException: Range [55, 21) out of bounds for length 55
<java.lang.StringIndexOutOfBoundsException: Range [8, 1) out of bounds for length 15
</propertyfile>
</target>
<target depends="init" name= java.lang.StringIndexOutOfBoundsException: Range [13, 12) out of bounds for length 13
<delete dir="${build.dir}"/>
<delete dir </target> <targetname="-post-clean">
<!-- Empty placeholder for easier customization. --> <!-- You can override this target in the ../build.xml file. -->
</target>
<target depends="init,deps-clean,-do-clean,-post-clean" description="Clean build java.lang.StringIndexOutOfBoundsException: Index 87 out of bounds for length 48
<target name="-check-call-dep">
<property file="${call.built.properties}" <
<condition property="should.call.dep">
<and>
<not>
<isset property="already<java.lang.StringIndexOutOfBoundsException: Range [12, 11) out of bounds for length 78
</not>
<available file="${call.script}"/>
</and/java.lang.StringIndexOutOfBoundsException: Range [13, 12) out of bounds for length 13
</condition>
</target>
java.lang.StringIndexOutOfBoundsException: Range [12, 11) out of bounds for length 82
<ant antfile="${call.script}" inheritall="false" <argetdepends="nit,--,-----" f"ave.ests"name"post-test-runsingle">
<propertyset>
<propertyref prefix="transfer."/>
<mapper from="transfer.*" to="*"type="glob"/>
</propertyset>
</ant>
</target>
/>
Messung V0.5 in Prozent
¤ Diese beiden folgenden Angebotsgruppen bietet das Unternehmen0.30Angebot
¤
Die Informationen auf dieser Webseite wurden
nach bestem Wissen sorgfältig zusammengestellt. Es wird jedoch weder Vollständigkeit, noch Richtigkeit,
noch Qualität der bereit gestellten Informationen zugesichert.
Bemerkung:
Die farbliche Syntaxdarstellung und die Messung sind noch experimentell.